{"text_format":"1","workbook":"xlsx","n_sheets":11,"sheets":["User Log","Change log","User inputs","Dashboard","RORE-Tables","Calculations","Scenario manager","Lists","CLEAR_SHEET","F_Inputs","END"],"not_rendered":{"charts":7,"images":1,"macros":1,"external_links":2,"defined_names":286,"comments":2,"pivot_tables":0},"unopened":[],"bounds":{"document_bytes":16777216,"sheet_cells":100000,"rows_first":2000,"rows_last":500,"rows_between":2000,"halvings":0,"cell_chars":16384,"cell_head_chars":4096},"cells_cut":0,"cells_raw":0,"read":"whole","date_system":"1900"}

{"sheet":"User Log","index":0,"n_rows":35,"n_cols":12,"rows_kept":35,"cut":false,"hidden":true,"merged":[]}
[]
[null,"The following people have accepted the terms and conditions: "]
[null,null,null,"Time and Date","Excel Username","Windows Username","Company"]
[null,null,null,"2014-02-18T12:49:42","Phil Griffiths","phil.griffiths","Ofwat"]
[null,null,null,"2014-02-18T16:30:50","Martin Holterman","martin.holterman","ddd",null,"TermsPart1","In connection with "]
[null,null,null,"2014-02-19T12:19:46","Alastair Sullivan","alastair.sullivan","Ofwat",null,"TermsPart2",", PricewaterhouseCoopers LLP (\"we\" or \"us\") understand that our "]
[null,null,null,"2014-02-27T14:47:46","Andy Duff","andy.duff","Ofwat",null,"TermsPart3",{"$f":"IF(DraftTickbox,\"draft \",\"\")","v":{"$error":"#REF!"}}]
[null,null,null,null,null,null,null,null,"TermsPart4","model dated "]
[null,null,null,null,null,null,null,null,"TermsPart5"," on "]
[null,null,null,null,null,null,null,null,"TermsPart6"," (the \"model\") will be made available to "]
[null,null,null,null,null,null,null,null,"TermsPart7"," (\"you\"). The model is addressed only to "]
[null,null,null,null,null,null,null,null,"TermsPart8"," (\"our client\").\n\n"]
[null,null,null,null,null,null,null,null,"TermsPart9","We will allow a copy of the model to be made available to you but only on the basis that you agree that:\n\n"]
[null,null,null,null,null,null,null,null,"TermsPart10","1. we accept no liability (including liability for negligence) to you in relation to the model. The model is provided to you for information purposes only. If you do rely on the model you do so entirely at your own risk. \n\n2. you will not bring a claim against us which relates to the provision of the model to you.\n\n3. neither the model, nor information obtained from it, may be made available to anyone else without our prior written consent, except where required by law or regulation. \n\n4. the model was prepared with our client’s interests in mind. It was not prepared with your interests in mind or for your use."]
[null,null,null,null,null,null,null,null,"TermsPart11",{"$f":"IF(DraftTickbox,\" The model is only a draft. \",\"\")","v":{"$error":"#REF!"}}]
{"$rows_left_out":21}
{"sheet":"Change log","index":1,"n_rows":16,"n_cols":3,"rows_kept":16,"cut":false,"hidden":false,"merged":[]}
[]
[null,"Ofwat - Risk assessment tool"]
[null,"Changes from version of RAT published 13 March 2014"]
[]
[null,1,"The allowed tax allowance included in the revenue requirement and the tax expense used in the RORE calculation is calculated using the higher of a company's actual capital structure and the notional capital structure (see p. 93 of Setting price controls for 2015-20 – final methodology and expectations for companies’ business plans)."]
[null,{"$f":"B5+1","v":2},"The tax expense used in the \"Stylised P&L\" of section II.5 \"Scenario Profit\" is now allocated between the different areas of the business based on the out-turn earnings before tax."]
[null,{"$f":"B6+1","v":3},"The SIM is now calibrated so that the base case incentive payment is 0."]
[null,4,"A set of cost performance menu parameters have been included in the \"Cost performance incentives\" box on the \"Dashboard\" worksheet."]
[null,5,"The free-cash flow impact has been deleted from he \"Scenario manager\" worksheet as this is no longer used in the tool."]
[null,6,"The opening RCV for water and sewerage in 2015-16 has been adjusted to reflect the use of year-average inflation rather than year-end inflation."]
[null,7,"An additional tab titled \"RORE-Tables\" has been added to the workbook. This decomposes the incremental impacts that make up the low and high end of the RORE range in the \"Combined scenario (company specified)\" scenario. This decomposition is set out on an annual basis as well as an average across the 2015-20 period."]
[null,8,"Connection & infrastructure charges (for water) and connection & requisition charges (for sewerage) have been included in the \"Stylised P&L\" sections in the \"Calculations\" worksheet. These are presented as an equal income and cost component in the year they are incurred and therefore net off to have no impact on out-turn results."]
[null,9,"The cash expenditure component of totex has been amended to exclude pension deficit repair payments."]
[null,10,"The retail expenditure in the allowed revenue uses the lower of the Average cost to serve (ACTS) input on the \"User inputs\" worksheet or the retail expenditure as submitted in company business plans."]
[null,11,"Tax calculations have been split into wholesale and retail components."]
{"$rows_left_out":2}
{"sheet":"User inputs","index":2,"n_rows":50,"n_cols":25,"rows_kept":50,"cut":false,"hidden":false,"merged":[[18,3,18,6],[14,12,14,13],[33,5,33,6],[42,5,42,6],[12,17,12,18],[30,17,30,18],[8,17,11,18],[25,24,26,24],[27,24,28,24],[25,23,28,23],[20,19,20,20],[21,19,21,20],[28,17,29,18],[10,22,10,23],[11,22,11,23],[12,22,12,23],[13,22,13,23],[14,22,14,23],[9,22,9,23]]}
[]
[]
[null,null,"Ofwat - Risk assessment tool",null,null,null,null,null,null,null,null,null,null,null,null,null,null,null,null,null,null,null,null,null,{"$f":"IFERROR(VLOOKUP(CompanyCode,Lists!$BE$6:$BF$23,2,FALSE),\"-\")","v":"-"}]
[null,null,"User inputs"]
[]
[]
[null,"Select company identifier",null,null,null,"Incentive selection",null,null,null,"Cost performance incentives",null,null,null,null,null,null,"Outcome delivery incentives (ODIs)"]
[]
[null,null,null,"Select",null,null,null,null,null,null,null,null,null,null,null,null,null,"Cost performance sharing rate used to calculate reward/penalty (set to 0% to use menu rate)",null,null,"ODI impact from BP scenarios that is in-year (% of total)"]
[null,null,null,null,null,null,null,null,null,null,"Menus: Performance  inputs",null,null,null,null,null,null,null,null,null,null,"Water","Wastewater",null,"Households"]
[null,null,null,null,null,null,null,null,null,null,null,null,"Water","Wastewater",null,null,null,null,null,null,"2015-16",0,0,null,0]
[null,"Uncertainty mechanisms",null,null,null,null,null,null,null,null,null,"Totex ratio",100,100,null,null,null,null,null,null,"2016-17",0,0,null,0]
[null,null,null,null,null,null,null,null,null,null,null,null,null,null,null,null,null,0.5,null,null,"2017-18",0,0,null,0]
[null,null,"On","Select",null,null,null,null,null,null,"Menus: 50% sharing rate assumption or full menu",null,null,null,null,null,null,null,null,null,"2018-19",0,0,null,0]
[null,null,null,null,null,null,null,null,null,null,null,"Select method:","Assumed 50% sharing rate",null,null,null,null,null,null,null,"2019-20",0,0,null,0]
{"$rows_left_out":36}
{"sheet":"Dashboard","index":3,"n_rows":366,"n_cols":34,"rows_kept":366,"cut":false,"hidden":false,"merged":[[105,30,106,30],[105,31,106,31],[105,32,106,32],[63,1,64,19],[6,1,7,9],[6,11,7,19],[35,17,36,17],[35,16,36,16],[35,18,36,18],[47,2,48,8],[32,2,33,8]]}
[]
[]
[null,null,"Ofwat - Risk assessment tool",null,null,null,null,null,null,null,null,null,null,null,null,null,null,null,null,null,null,null,null,null,null,null,null,null,null,null,null,null,{"$f":"Company.Name","v":"-"}]
[null,null,"Dashboard",null,null,null,null,null,null,null,null,null,null,null,null,null,null,null,null,null,null,null,null,null,null,null,null,null,null,null,null,null,{"$f":"INDEX(Lists!$AZ$6:$BA$32,MATCH('Scenario manager'!$F$9,Lists!AZ6:$AZ$32,0),2)","v":"Base case"}]
[]
[]
[null,{"$f":"\"1. RORE (based on \"&$AG$4&\" and incentive selection)\"","v":"1. RORE (based on Base case and incentive selection)"},null,null,null,null,null,null,null,null,null,"2. Average RORE range for appointed business (all scenarios macro output) (2015-2020)",null,null,null,null,null,null,null,null,null,"3. Average RORE range for water and sewerage (all scenarios macro output) (2015-2020)"]
[]
[null,null,null,null,null,null,null,null,null,null,null,null,null,null,null,null,null,null,null,null,null,null,"Wholesale water RORE",null,null,null,null,null,null,"Wholesale sewerage RORE"]
[]
[]
[]
[]
[]
[]
{"$rows_left_out":352}
{"sheet":"RORE-Tables","index":4,"n_rows":100,"n_cols":20,"rows_kept":100,"cut":false,"hidden":false,"merged":[[89,16,91,16],[93,16,95,16],[79,16,81,16],[15,16,19,16],[21,16,25,16],[31,16,34,16],[36,16,39,16],[46,16,48,16],[50,16,52,16],[60,16,63,16],[65,16,68,16],[75,16,77,16]]}
[]
[]
[null,"Ofwat - Risk assessment tool"]
[null,"Components of out(under) performance"]
[]
[]
[null,"Notes:"]
[null,"The data set out in the tables below are sourced from the \"Combined scenario (company specified)\" scenario."]
[null,"Wholesale and appointee level out(under) performance is expressed as a proportion of regulated equity. "]
[null,"Retail Households out(under)performance is measured as a proportion of total household invoiced revenue."]
[]
[null,"Appointee level"]
[null,null,"Incremental impacts to RORE - Low",null,null,null,null,null,null,"Incremental impacts to RORE - High",null,null,null,null,null,null,null,"Incremental impact to RORE"]
[null,null,"2015-16","2016-17","2017-18","2018-19","2019-20","Average",null,"2015-16","2016-17","2017-18","2018-19","2019-20","Average",null,null,null,"Impact","RORE"]
[null,"Base case RORE",{"$f":"Dashboard!F273","v":0},{"$f":"Dashboard!G273","v":0},{"$f":"Dashboard!H273","v":0},{"$f":"Dashboard!I273","v":0},{"$f":"Dashboard!J273","v":0},{"$f":"AVERAGE(C15:G15)","v":0},null,{"$f":"C15","v":0},{"$f":"D15","v":0},0,0,0,0,null,null,null,"on RORE"]
{"$rows_left_out":86}
{"sheet":"Calculations","index":5,"n_rows":772,"n_cols":49,"rows_kept":772,"cut":false,"hidden":false,"merged":[]}
[]
[]
[null,null,"Ofwat - Risk assessment tool",null,null,null,null,null,null,null,null,null,null,null,null,null,null,null,null,null,null,null,null,null,null,null,null,null,null,null,null,null,null,null,null,null,null,null,null,null,null,null,null,null,null,{"$f":"Company.Name","v":"-"}]
[null,null,"Calculations - Business template"]
[]
[null,null,null,null,"Year","1988-89","1989-90","1990-91","1991-92","1992-93","1993-94","1994-95","1995-96","1996-97","1997-98","1998-99","1999-00","2000-01","2001-02","2002-03","2003-04","2004-05","2005-06","2006-07","2007-08","2008-09","2009-10","2010-11","2011-12","2012-13","2013-14","2014-15","2015-16","2016-17","2017-18","2018-19","2019-20","2020-21","2021-22","2022-23","2023-24","2024-25","2025-26",null,"2015-20","2020-25"]
[null,null,null,null,"Actual Year",1988,1989,1990,1991,1992,1993,1994,1995,1996,1997,1998,1999,2000,2001,2002,2003,2004,2005,2006,2007,2008,2009,2010,2011,2012,2013,2014,2015,2016,2017,2018,2019,2020,2021,2022,2023,2024,2025]
[null,null,null,null,"Year (relative to base year)",null,null,null,null,null,null,null,null,null,null,null,null,null,null,null,null,null,null,null,null,null,null,null,null,0,{"$f":"AD8+1","v":1},2,3,4,5,6,7,8,{"$f":"AL8+1","v":9},{"$f":"AM8+1","v":10},{"$f":"AN8+1","v":11},{"$f":"AO8+1","v":12},{"$f":"AP8+1","v":13}]
[null,null,null,null,"Year (within price control)",null,null,null,null,null,null,null,null,null,null,null,null,null,null,null,null,null,null,null,null,null,null,null,null,null,null,4,0,1,2,3,4,0,1,2,3,4,0]
[null,null,null,null,"Year (relative to start of AMP6)",null,null,null,null,null,null,null,null,null,null,null,null,null,null,null,null,null,null,null,null,null,null,null,null,null,null,-1,{"$f":"AF10+1","v":0},1,2,3,4,5,{"$f":"AL10+1","v":6},7,8,9,10]
[null,null,null,null,"Year (relative to end of AMP6)",null,null,null,null,null,null,null,null,null,null,null,null,null,null,null,null,null,null,null,null,null,null,null,null,null,null,{"$f":"AG11-1","v":-5},{"$f":"AH11-1","v":-4},{"$f":"AI11-1","v":-3},{"$f":"AJ11-1","v":-2},{"$f":"AK11-1","v":-1},0,{"$f":"AK11+1","v":1},2,3,4,5,6]
[]
[]
[null,null,"Financial Calculations"]
[]
{"$rows_left_out":758}
{"sheet":"Scenario manager","index":6,"n_rows":204,"n_cols":46,"rows_kept":204,"cut":false,"hidden":false,"merged":[]}
[]
[]
[null,"Ofwat - Risk assessment tool",null,null,{"$f":"Company.Name","v":"-"}]
[null,"Scenario manager",null,null,2,{"$f":"Scenario_Input","v":"Base case"}]
[]
[]
[null,null,null,null,null,"Live scenario",null,null,"Households scenario (Ofwat specified)",null,null,"Industrial demand scenario (Ofwat specified)",null,null,"Input cost scenario (Ofwat specified)",null,null,"Combined economic scenario (Ofwat specified)",null,null,"Rainfall scenario (Ofwat specified)",null,null,"Company specific scenario 1 (Company specified)",null,null,"Company specific scenario 2 (Company specified)",null,null,"Company specific scenario 3 (Company specified)",null,null,"Company specific scenario 4 (Company specified)",null,null,"Company specific scenario 5 (Company specified)",null,null,"Company specific scenario 6 (Company specified)",null,null,"Incentive performance (Company specified)",null,null,"Combined scenario (Company specified)"]
[null,"Unit dp",null,"Inputs",null,null,null,null,"Low","High",null,"Low","High",null,"Low","High",null,"Low","High",null,"Low","High",null,"Low","High",null,"Low","High",null,"Low","High",null,"Low","High",null,"Low","High",null,"Low","High",null,"Low","High",null,"Low","High"]
[null,null,null,null,null,{"$f":"INDEX(All_scenarios,MATCH(ActiveScenario&Sce_level,Lists!J6:J33,0),2)","v":"Base case"},null,null,{"$f":"Lists!$K$8","v":"Scenario 1a"},{"$f":"Lists!$K$9","v":"Scenario 1b"},null,{"$f":"Lists!$K$10","v":"Scenario 2a"},{"$f":"Lists!$K$11","v":"Scenario 2b"},null,{"$f":"Lists!$K$12","v":"Scenario 3a"},{"$f":"Lists!$K$13","v":"Scenario 3b"},null,{"$f":"Lists!$K$14","v":"Scenario 4a"},{"$f":"Lists!$K$15","v":"Scenario 4b"},null,{"$f":"Lists!$K$16","v":"Scenario 5a"},{"$f":"Lists!$K$17","v":"Scenario 5b"},null,{"$f":"Lists!$K$18","v":"Scenario 6a"},{"$f":"Lists!$K$19","v":"Scenario 6b"},null,{"$f":"Lists!$K$20","v":"Scenario 7a"},{"$f":"Lists!$K$21","v":"Scenario 7b"},null,{"$f":"Lists!$K$22","v":"Scenario 8a"},{"$f":"Lists!$K$23","v":"Scenario 8b"},null,{"$f":"Lists!$K$24","v":"Scenario 9a"},{"$f":"Lists!$K$25","v":"Scenario 9b"},null,{"$f":"Lists!$K$26","v":"Scenario 10a"},{"$f":"Lists!$K$27","v":"Scenario 10b"},null,{"$f":"Lists!$K$28","v":"Scenario 11a"},{"$f":"Lists!$K$29","v":"Scenario 11b"},null,{"$f":"Lists!$K$30","v":"Scenario 12a"},{"$f":"Lists!$K$31","v":"Scenario 12b"},null,{"$f":"Lists!$K$32","v":"Scenario 13a"},{"$f":"Lists!$K$33","v":"Scenario 13b"}]
[null,"Active incentive mechanisms"]
[]
[null,"Text",null,"Water: Cost performance incentives",null,true]
[null,"Text",null,"Sewerage: Cost performance incentives",null,true]
[null,"Text",null,"Service incentive mechanism (SIM)",null,true]
[null,"Text",null,"Water trading: Exports",null,true]
{"$rows_left_out":190}
{"sheet":"Lists","index":7,"n_rows":52,"n_cols":62,"rows_kept":52,"cut":false,"hidden":false,"merged":[[13,23,13,24],[7,18,10,19],[7,47,7,48],[8,47,8,48],[9,27,9,28],[7,27,8,28],[11,18,11,19],[9,23,9,24],[10,23,10,24],[11,23,11,24],[12,23,12,24]]}
[]
[null,"Lists & ranges used in workbook"]
[null,null,null,null,null,null,null,"Scenario_range",null,null,null,null,null,null,null,null,null,null,null,null,null,null,null,null,null,null,null,null,null,null,null,null,null,null,null,"2015-20"]
[null,"Range name:",null,"Region_options",null,"CPI_options",null,"Scenario_range_exBC",null,"All_scenarios","Scenario_16",null,null,null,"Lists_Menu1; Lists_Menu2",null,null,null,"Lists_ODIs",null,null,null,null,null,null,null,null,"Lists_SIM",null,null,"Lists_PAYG",null,null,null,null,"WACC_inputs",null,null,null,null,null,"Lists.Net.Margins",null,null,null,"Lists_trading",null,null,null,null,null,null,null,null,null,null,"Company.codes"]
[null,"Description:",null,"Regions",null,"Cost performance option",null,"Scenario name",null,"All scenarios",null,null,"Method used to apply run off rate",null,"Default cost performance menu inputs",null,null,null,"ODI defaults",null,null,null,null,null,null,null,null,"SIM defaults",null,null,"Flexible defaults",null,null,null,null,"Weighted average cost of capital inputs",null,null,null,null,null,"Retail net margins",null,null,null,"Trading defaults",null,null,null,null,null,"All scenarios",null,null,null,null,"Company codes"]
[null,null,null,"England",null,"Full menu parameters",null,"Base case",null,"Base case1","Base case",null,"Straight line",null,null,null,null,null,"Outcome delivery incentives (ODIs)",null,null,null,null,null,null,null,null,"Service incentive mechanism",null,null,"PAYG ratio","Water",null,"Wastewater",null,null,"Water",null,"Wastewater",null,null,null,null,null,null,null,null,null,null,null,null,"Base case","Base case",null,null,null,"ANH","Anglian Water Services Ltd","England",null,"Yes","On"]
[null,null,null,"Wales",null,"Assumed 50% sharing rate",null,"Households scenario (Ofwat specified)",null,"Base case2","Base case",null,"Reducing balance",null,null,"Water","Wastewater",null,null,null,null,null,null,null,null,null,null,null,null,null,"2015-16",{"$f":"IF(SUM(AF$15:AF$19)=0,AF$14,AF15)","v":0},null,{"$f":"IF(SUM(AH$15:AH$19)=0,AH$14,AH15)","v":0},null,"Gearing",0.625,null,0.625,null,null,"Ofwat retail net margin (%)",null,null,null,"Water trading ceiling",null,null,null,null,null,"Scenario 1a","Households scenario (Ofwat specified) - Low",null,null,null,"NES","Northumbrian Water Ltd","England",null,"No","Off"]
[null,null,null,null,null,null,null,"Industrial demand scenario (Ofwat specified)",null,"Households scenario (Ofwat specified)1","Scenario 1a",null,null,null,"Menu type","Standard","Standard",null,"Cost performance sharing rate used to calculate reward/penalty (set to 0% to use menu rate)",null,null,"ODI impact from BP scenarios that is in-year (% of total)",null,null,null,null,null,"% of non-HH revenue to include (Wales only)",null,null,"2016-17",{"$f":"IF(SUM(AF$15:AF$19)=0,AF$14,AF16)","v":0},null,0,null,"Cost of debt",2.75E-2,null,2.75E-2,null,null,"Household",0.01,null,null,null,"Water trading - export",0.05,null,"% of wholesale water revenue",null,"Scenario 1b","Households scenario (Ofwat specified) - High",null,null,null,"NWT","United Utilities Water Plc","England"]
[null,null,null,null,null,null,null,"Input cost scenario (Ofwat specified)",null,"Households scenario (Ofwat specified)2","Scenario 1b",null,null,null,"Menu \"kink\"",100,100,null,null,null,null,null,"Water","Wastewater",null,"Households",null,null,null,null,"2017-18",0,null,0,null,"WACC, vanilla",3.6999999999999998E-2,null,3.6999999999999998E-2,null,null,"Non-Household",2.5000000000000001E-2,null,null,null,"Water trading - import",1E-3,null,"% of wholesale water revenue",null,"Scenario 2a","Industrial demand scenario (Ofwat specified) - Low",null,null,null,"SRN","Southern Water Services Ltd","England"]
[null,null,null,null,null,null,null,"Combined economic scenario (Ofwat specified)",null,"Industrial demand scenario (Ofwat specified)1","Scenario 2a",null,null,null,null,null,null,null,null,null,null,"2015-16",0,0,null,0,null,0.8,null,null,"2018-19",0,null,0,null,null,null,null,null,null,null,null,null,null,null,null,null,null,null,null,null,"Scenario 2b","Industrial demand scenario (Ofwat specified) - High",null,null,null,"SVT","Severn Trent Water Ltd","England"]
[null,null,null,null,null,null,null,"Rainfall scenario (Ofwat specified)",null,"Industrial demand scenario (Ofwat specified)2","Scenario 2b",null,null,null,"Minimum ratio",80,80,null,null,null,null,"2016-17",0,0,null,0,null,null,null,null,"2019-20",0,null,0,null,null,null,null,null,null,null,"Company retail net margin (%)",null,null,null,null,null,null,null,null,null,"Scenario 3a","Input cost scenario (Ofwat specified) - Low",null,null,null,"SWT","South West Water Ltd","England"]
[null,null,null,null,null,null,null,"Company specific scenario 1 (Company specified)",null,"Input cost scenario (Ofwat specified)1","Scenario 3a",null,null,null,"Maximum ratio",130,130,null,0.5,null,null,"2017-18",0,0,null,0,null,null,null,null,null,null,null,null,null,null,null,null,null,null,null,null,"R5004","R5011",null,null,null,null,null,null,null,"Scenario 3b","Input cost scenario (Ofwat specified) - High",null,null,null,"TMS","Thames Water Utilities Ltd","England"]
[null,null,null,null,null,null,null,"Company specific scenario 2 (Company specified)",null,"Input cost scenario (Ofwat specified)2","Scenario 3b",null,null,null,null,null,null,null,null,null,null,"2018-19",0,0,null,0,null,null,null,null,null,"W10004",null,"S10004",null,"W18021",{"$f":"IFERROR(INDEX(F_Inputs_Index,MATCH($AJ$13,F_Inputs_Row,0),MATCH($AJ$3,F_Inputs_Column,0)),\"\")","v":0},null,{"$f":"IFERROR(INDEX(F_Inputs_Index,MATCH($AN$13,F_Inputs_Row,0),MATCH($AJ$3,F_Inputs_Column,0)),\"\")","v":0},"S18021",null,"2015-16",{"$f":"INDEX(F_Inputs_Index,MATCH(AQ$12,F_Inputs_Row,0),MATCH($AP13,F_Inputs_Column,0))","v":0},0,null,null,null,null,null,null,null,"Scenario 4a","Combined economic scenario (Ofwat specified) - Low",null,null,null,"WSH","Welsh Water (Dŵr Cymru Cyfyngedig)","Wales"]
[null,null,null,null,null,null,null,"Company specific scenario 3 (Company specified)",null,"Combined economic scenario (Ofwat specified)1","Scenario 4a",null,null,null,"Standard menu","Water","Wastewater",null,null,null,null,"2019-20",0,0,null,0,null,null,null,null,"2015-20",{"$f":"IFERROR(INDEX(F_Inputs_Index,MATCH(AF$13,F_Inputs_Row,0),MATCH($AE14,F_Inputs_Column,0)),\"\")","v":0},null,{"$f":"IFERROR(INDEX(F_Inputs_Index,MATCH(AH$13,F_Inputs_Row,0),MATCH($AE14,F_Inputs_Column,0)),\"\")","v":0},null,"W18016",{"$f":"IFERROR(INDEX(F_Inputs_Index,MATCH($AJ$14,F_Inputs_Row,0),MATCH($AJ$3,F_Inputs_Column,0)),\"\")","v":0},null,{"$f":"IFERROR(INDEX(F_Inputs_Index,MATCH($AN$14,F_Inputs_Row,0),MATCH($AJ$3,F_Inputs_Column,0)),\"\")","v":0},"S18016",null,"2016-17",0,0,null,null,null,null,null,null,null,"Scenario 4b","Combined economic scenario (Ofwat specified) - High",null,null,null,"WSX","Wessex Water Services Ltd","England"]
[null,null,null,null,null,null,null,"Company specific scenario 4 (Company specified)",null,"Combined economic scenario (Ofwat specified)2","Scenario 4b",null,null,null,"(Menu A: <= \"kink\")",null,null,null,null,null,null,null,null,null,null,null,null,null,null,null,"2015-16",0,null,0,null,"W18022",{"$f":"IFERROR(INDEX(F_Inputs_Index,MATCH($AJ$15,F_Inputs_Row,0),MATCH($AJ$3,F_Inputs_Column,0)),\"\")","v":0},null,{"$f":"IFERROR(INDEX(F_Inputs_Index,MATCH($AN$15,F_Inputs_Row,0),MATCH($AJ$3,F_Inputs_Column,0)),\"\")","v":0},"S18022",null,"2017-18",0,0,null,null,null,null,null,null,null,"Scenario 5a","Rainfall scenario (Ofwat specified) - Low",null,null,null,"YKY","Yorkshire Water Services Ltd","England"]
{"$rows_left_out":38}
{"sheet":"CLEAR_SHEET","index":8,"n_rows":19,"n_cols":2,"rows_kept":19,"cut":false,"hidden":true,"merged":[]}
["FOUNTAIN_INSTANCE_URL","https://fntlive201/Fountain/rest-services"]
["companyId",59]
["companyName","South West Water Ltd"]
["inputRunName","Run 4: pre-qual control run"]
["inputRunId",43]
["outputRunName","Run 4: pre-qual control run"]
["outputRunId",43]
["tagName","latest"]
["tagId",0]
["F_Inputs_TABLE_ID",6264]
["F_Inputs_TEAM","IPL"]
["F_Inputs_USER","OFWAT\\martin.holterman"]
["F_Inputs_NAME","PL14A002IN"]
["F_Inputs_TITLE"]
["allowselectRun",true]
{"$rows_left_out":5}
{"sheet":"F_Inputs","index":9,"n_rows":645,"n_cols":22,"rows_kept":645,"cut":false,"hidden":false,"merged":[]}
["Inputs "]
["Acronym","Reference","Item description","Unit",null,null,"2012-13","2013-14","2014-15","2015-16","2016-17","2017-18","2018-19","2019-20","2020-21","2021-22","2022-23","2023-24","2024-25","2025-26","2015-20","2020-25"]
[]
["Wholesale water data"]
[null,"BP767N","Total capital expenditure excluding grants and contributions","£m"]
[null,"BM351TAS","Total operating expenditure (Total - accounting separation)","£m"]
[null,"W3016","Total cash expenditure (ex. pension deficit repair payments)","£m"]
[null,"W9002","Connection & infrastructure charges","£m"]
[null,"W10001","Run-off rate - water","%"]
[null,"W10002","Method used to apply run off rate (straight line or reducing balance)","Text"]
[null,"W10003","Totex average life","years"]
[null,"W10004","PAYG% - water","%"]
[null,"W18009","Gearing","%"]
[null,"W18021","Gearing","%"]
[null,"W18004","Cost of debt","%"]
{"$rows_left_out":631}
{"sheet":"END","index":10,"n_rows":0,"n_cols":0,"rows_kept":0,"cut":false,"hidden":false,"merged":[]}