{"text_format":"1","workbook":"xlsx","n_sheets":16,"sheets":["Cover","User Guide","Map & Key","Inputs >>","WINEP_Inputs","Time","InpActive","Calcs >>","WINEP_Schemes","WINEP_Allowance","Outputs >>","Annual_Outputs","F_Outputs","QA >>","Track","Check"],"not_rendered":{"charts":0,"images":1,"macros":1,"external_links":0,"defined_names":59,"comments":0,"pivot_tables":0},"unopened":[],"bounds":{"document_bytes":16777216,"sheet_cells":100000,"rows_first":2000,"rows_last":500,"rows_between":2000,"halvings":0,"cell_chars":16384,"cell_head_chars":4096},"cells_cut":0,"cells_raw":0,"read":"whole","date_system":"1900"}

{"sheet":"Cover","index":0,"n_rows":39,"n_cols":7,"rows_kept":39,"cut":false,"hidden":false,"merged":[[7,3,7,4],[22,3,22,4],[10,3,10,6],[11,3,11,6],[12,3,12,6],[13,3,13,6],[14,3,14,6]]}
[{"$f":" RIGHT(CELL(\"filename\", $A$1), LEN(CELL(\"filename\", $A$1)) - SEARCH(\"]\", CELL(\"filename\", $A$1)))","v":"Cover"}]
[]
[null,null,"Model name:","WINEP Reconciliation Model"]
[null,null,"Version number:",{"$f":" LEFT(D5, FIND(\".\", D5, 1) - 1)","v":"WINEP Reconciliation Model v1g"}]
[null,null,"Filename:",{"$f":" MID(CELL(\"filename\"), FIND(\"[\", CELL(\"filename\"), 1) + 1, FIND(\"]\", CELL(\"filename\"), 1) - FIND(\"[\", CELL(\"filename\"), 1) - 1)","v":"WINEP Reconciliation Model v1g.xlsm"}]
[null,null,"Date:","2019-09-02"]
[null,null,"Author:","Ofwat"]
[null,null,"Author contact information:","pr19@ofwat.gov.uk"]
[]
[]
{"$rows_left_out":30}
{"sheet":"User Guide","index":1,"n_rows":82,"n_cols":5,"rows_kept":82,"cut":false,"hidden":false,"merged":[]}
[{"$f":" RIGHT(CELL(\"filename\", $A$1), LEN(CELL(\"filename\", $A$1)) - SEARCH(\"]\", CELL(\"filename\", $A$1)))","v":"User Guide"}]
[]
[null,"INTRODUCTION"]
[]
[null,null,null,null,"This model will calculate the WINEP reconciliation adjustment in £m."]
[]
[null,null,null,"NAVIGATION"]
[null,null,null,null,"In order to navigate through the model the following key strokes will prove useful:"]
[null,null,null,null,"- To go to a sheet or row select a blue font cell and then either press CTRL+ [ or double click"]
[null,null,null,null,"- To return to the last position press F5 + Enter"]
{"$rows_left_out":73}
{"sheet":"Map & Key","index":2,"n_rows":93,"n_cols":26,"rows_kept":93,"cut":false,"hidden":false,"merged":[]}
[{"$f":" RIGHT(CELL(\"filename\", $A$1), LEN(CELL(\"filename\", $A$1)) - SEARCH(\"]\", CELL(\"filename\", $A$1)))","v":"Map & Key"}]
[]
["GENERIC MODEL DESIGN"]
[]
[null,null,null,null,null,"Table of Contents"]
[]
[]
[null,null,null,null,null,null,null,"DOCUMENTATION",null,null,null,"MODEL INPUTS",null,null,null,null,"MODEL CALCULATIONS",null,null,null,null,"MODEL OUTPUTS",null,null,null,"MODEL QA"]
[]
[null,null,null,null,null,null,null,"Cover",null,null,null,"WINEP_Inputs",null,null,null,null,"WINEP_Schemes",null,null,null,null,"Annual_Outputs",null,null,null,"Check"]
{"$rows_left_out":84}
{"sheet":"Inputs >>","index":3,"n_rows":0,"n_cols":0,"rows_kept":0,"cut":false,"hidden":false,"merged":[]}

{"sheet":"WINEP_Inputs","index":4,"n_rows":7,"n_cols":99,"rows_kept":7,"cut":false,"hidden":false,"merged":[[2,52,2,67],[2,85,2,91],[1,18,1,19],[1,34,1,51],[2,3,2,33],[2,34,2,38],[2,39,2,40],[2,41,2,48],[2,49,2,50]]}
["WINEP3  Update March 2019",null,null,null,null,null,null,"National Full data set "]
[null,null,null,null,null,null,null,null,null,null,null,null,null,null,null,null,null,null,null,null,null,null,null,null,null,null,null,null,null,null,null,null,null,null,"FBG Detail"]
["VERSION 1",null,null,null,null,null,null,null,null,null,null,null,null,null,null,null,null,null,null,null,null,null,null,null,null,null,null,null,null,null,null,null,null,null,"SSSI/N2K/Ramsar",null,null,null,null,"Eels",null,"NERC Driver",null,null,null,null,null,null,null,"INNS",null,"MCZ","Water Quality Detail",null,null,null,null,null,null,null,null,null,null,null,null,null,null,null,null,null,null,null,null,null,null,"Water Resource Detail",null,null,null,null,null,null,null,null,null,"Environmental Outcome "]
["WINEPID","Change Log Winep 2 to 3  ","NEW Column. Has an alteration to this measure been made? If Y then please refer to alterations log. ","Application in determination by NPS?","Has a permit been issued?","Function","RBD","Area","Water Company ","Unique ID *   (completed on company collation)","Scheme Name/Name of Investigation/Site Name/Licence name","Name of Waterbody","Waterbody ID","Water Body Type(s)","WFD Operational Catchment","Blank Column","Blank Column","Blank Column","Driver Code \n(Primary)","Further Driver Code Information \n(related to the primary driver if applicable)","Driver Code \n(Secondary)","Further Driver Code Information \n(related to the secondary driver if applicable)","Driver Code\n(Tertiary)","Further Driver Code Information \n(related to the tertiary driver if applicable)","Measure Type","Completion Date (DD/MM/YY)","Level of Certainty? (P= Purple, R=Red, A=Amber, G=Green","Abstraction Licence/ Permit, Obstruction ID or No Obstruction ID","Eastings","Northings","Investigation Type","Investigation Scope","Implementation Scope","Groundwater Measures Information","Name of SSSI \n(if applicable)","Name of N2K/Ramsar site \n(if applicable)","SSSI/N2K/Ramsar Unit ID","SSSI/N2K/Ramsar Area of Unit (Hectares)","Justification for Action/Investigation","Eel Priority Status","Eel Improvement Type ","Primary Type of Priority Habitat Created or Restored/Improved","Secondary Type of Priority Habitat Created or Restored/Improved","Other Priority Habitat Created or Restored/Improved","Type of Action Taken","Units Recorded (Hectare or km)","Number of Hectares or Kms","Name of Priority Species","Name of High Risk of Extinction Species","INNS Control Measure","INNS Species \n(if applicable)","Name of MCZ","Name of Bathing Water \n(where applicable)","Name of Shellfish Water \n(where applicable)","Chemical of Interest \n(for chemicals measures only)","Groundwater Chemicals","Drinking Water Inspectorate - Undertaking or Notice \nY/N","DrWPA Substances at Risk\n(if applicable)","Safeguard Zone Name \n(if applicable)","Safeguard Zone ID \n(if applicable)","Population Equivalent for STWs ","Current Permit Limit (mg/l)","Proposed Permit Limit (mg/l)","Proposed Iron or Aluminium Limits \n(for Phosphorus measures only)","Current DWF (m3/d)","Proposed DWF (m3/d) \n(if applicable)","Proposed Permit Limit Other","Catchment Measure Actions ","Unsustainable Abstraction System Code","Linked Groundwater Body Name","Linked Groundwater Body ID","Licence Category","Water Resource Zone \n(WRZ)","WR HMWB Flag  \n(X)","Scheme Relates to Following Missing Mitigation Measures \n(HMWB only)","Annual Licence Volume (Ml/a)","Daily Licence Volume (Ml/d)","Aggregate Licence (x)","Sustainability Change (to Annual Licence Volume) \nMl/a","Sustainability Change (to Daily Licence Volume) \nMl/d","Sustainability Change (to HoF Condition) \nMl/d","*NEW* \nWater returned to the environment (Reduction in actual abstraction) ML/d","New Annual Licence Volume \n(Ml/a)","New Daily Licence Volume \n(Ml/d)","New HoF Condition \n(Ml/d)","Quantitative\nKm River Length Improved or Protected ","Quantitative\nArea (km2) Improved or Protected","Volume (Ml/yr) Drinking Water Protected","Hectares of Designated Site (HD/RAMSAR/\nSSSI) Restored or Improved","*NEW* \nINNS ,No Det outcome - Km2 of land with reduced risk of INNS","Delivers Additional FCERM Benefits \n(Y/N)","Delivers on Salmon 5-Point Action Plan","Additional Comments","CPS Reference","Flow Categorisation\n1= PR19 Synergy\n2= WFD failure\n3= Neither","Calc Column 1","Calc Column 2","1 = In plan\n0 = Not in plan","1 = Confirmed\n0 = Not confirmed"]
["EX00001","EXAMPLE - delete this row",null,null,null,"WR","Humber","Yorkshire","Yorkshire Water Service Ltd","XXW000001","Sample Fish Passage","Sample waterbody","GB104027057490","River","Sample",null,null,null,null,null,null,null,null,null,null,"dd/mm/2024","Amber",null,111111,222222,null,null,null,null,null,null,null,null,null,null,null,null,null,null,null,null,null,null,null,null,null,null,null,null,null,null,null,null,null,null,null,null,null,null,null,null,null,null,null,null,"",null,null,null,null,null,null,null,null,null,null,null,null,null,null,null,null,null,null,null,null,null,null,null,null,5,30000,1,1]
["EX00002","EXAMPLE - delete this row",null,null,null,"FBG","Humber","Yorkshire","Yorkshire Water Service Ltd","XXW000002","Investigation - reservoirs ","Sample","Water Company Scale",null,"Sample",null,null,null,null,null,null,null,null,null,null,"dd/mm/2024","Amber",null,null,null,null,null,null,null,null,null,null,null,null,null,null,null,null,null,null,null,null,null,null,null,null,null,null,null,null,null,null,null,null,null,null,null,null,null,null,null,null,null,null,null,"",null,null,null,null,null,null,null,null,null,null,null,null,null,null,null,null,null,null,null,null,null,null,null,null,null,10000,1,{"$f":" 18 / 20","v":0.9}]
["EX00003","EXAMPLE - delete this row",null,null,null,"WQ","Humber","Yorkshire","Yorkshire Water Service Ltd","XXW000003","Sample STW","Sample waterbody","GB104027057452","River","Sample",null,null,null,null,"Phosphorus",null,null,null,null,null,"dd/mm/2024","Amber",null,111111,222222,null,null,null,null,null,null,null,null,null,null,null,null,null,null,null,null,null,null,null,null,null,null,null,null,null,null,null,null,null,null,null,null,null,null,null,null,null,null,null,null,"",null,null,null,null,null,null,null,null,null,null,null,null,null,null,null,null,null,null,null,null,null,null,null,null,1,5,1,0]

{"sheet":"Time","index":5,"n_rows":129,"n_cols":20,"rows_kept":129,"cut":false,"hidden":false,"merged":[]}
[{"$f":" RIGHT(CELL(\"FILENAME\", $A$1), LEN(CELL(\"FILENAME\", $A$1)) - SEARCH(\"]\", CELL(\"FILENAME\", $A$1)))","v":"Time"}]
[null,null,null,null,{"$f":" Time!E$25","v":"Model period ending"},null,null,null,null,{"$f":" Time!J$25","v":"2019-03-31"},{"$f":" Time!K$25","v":"2020-03-31"},{"$f":" Time!L$25","v":"2021-03-31"},{"$f":" Time!M$25","v":"2022-03-31"},{"$f":" Time!N$25","v":"2023-03-31"},{"$f":" Time!O$25","v":"2024-03-31"},{"$f":" Time!P$25","v":"2025-03-31"},{"$f":" Time!Q$25","v":"2026-03-31"},{"$f":" Time!R$25","v":"2027-03-31"},{"$f":" Time!S$25","v":"2028-03-31"},{"$f":" Time!T$25","v":"2029-03-31"}]
[null,null,null,null,{"$f":" Time!E$103","v":"Timeline label"},null,null,null,null,{"$f":" Time!J$103","v":"Pre-Fcst"},{"$f":" Time!K$103","v":"Pre-Fcst"},{"$f":" Time!L$103","v":"Forecast"},{"$f":" Time!M$103","v":"Forecast"},{"$f":" Time!N$103","v":"Forecast"},{"$f":" Time!O$103","v":"Forecast"},{"$f":" Time!P$103","v":"Forecast"},{"$f":" Time!Q$103","v":"Post-Fcst"},{"$f":" Time!R$103","v":"Post-Fcst"},{"$f":" Time!S$103","v":"Post-Fcst"},{"$f":" Time!T$103","v":"Post-Fcst"}]
[null,null,null,null,{"$f":" Time!E$126","v":"Financial year ending"},null,null,null,null,{"$f":" Time!J$126","v":2019},{"$f":" Time!K$126","v":2020},{"$f":" Time!L$126","v":2021},{"$f":" Time!M$126","v":2022},{"$f":" Time!N$126","v":2023},{"$f":" Time!O$126","v":2024},{"$f":" Time!P$126","v":2025},{"$f":" Time!Q$126","v":2026},{"$f":" Time!R$126","v":2027},{"$f":" Time!S$126","v":2028},{"$f":" Time!T$126","v":2029}]
[null,null,null,null,{"$f":" Time!E$10","v":"Model column counter"},"Constant","Unit","Total",null,{"$f":" Time!J$10","v":1},{"$f":" Time!K$10","v":2},{"$f":" Time!L$10","v":3},{"$f":" Time!M$10","v":4},{"$f":" Time!N$10","v":5},{"$f":" Time!O$10","v":6},{"$f":" Time!P$10","v":7},{"$f":" Time!Q$10","v":8},{"$f":" Time!R$10","v":9},{"$f":" Time!S$10","v":10},{"$f":" Time!T$10","v":11}]
[]
["MODEL PERIOD"]
[]
[null,"Model column counter "]
[null,null,null,null,"Model column counter",null,"counter",null,null,{"$f":" I10 + 1","v":1},{"$f":" J10 + 1","v":2},{"$f":" K10 + 1","v":3},{"$f":" L10 + 1","v":4},5,6,{"$f":" O10 + 1","v":7},{"$f":" P10 + 1","v":8},{"$f":" Q10 + 1","v":9},{"$f":" R10 + 1","v":10},11]
{"$rows_left_out":120}
{"sheet":"InpActive","index":6,"n_rows":41,"n_cols":19,"rows_kept":41,"cut":false,"hidden":false,"merged":[]}
[{"$f":" RIGHT(CELL(\"FILENAME\", $A$1), LEN(CELL(\"FILENAME\", $A$1)) - SEARCH(\"]\", CELL(\"FILENAME\", $A$1)))","v":"InpActive"}]
[null,null,null,null,{"$f":"Time!E25","v":"Model period ending"},{"$f":"Check!F2","v":0},"Checks",null,null,{"$f":" Time!J$25","v":"2019-03-31"},{"$f":" Time!K$25","v":"2020-03-31"},{"$f":" Time!L$25","v":"2021-03-31"},{"$f":" Time!M$25","v":"2022-03-31"},{"$f":" Time!N$25","v":"2023-03-31"},{"$f":" Time!O$25","v":"2024-03-31"},{"$f":" Time!P$25","v":"2025-03-31"},{"$f":" Time!Q$25","v":"2026-03-31"},{"$f":" Time!R$25","v":"2027-03-31"},{"$f":" Time!S$25","v":"2028-03-31"}]
[null,null,null,null,{"$f":"Time!E103","v":"Timeline label"},{"$f":"Check!F3","v":0},"Track chgs",null,null,{"$f":" Time!J$103","v":"Pre-Fcst"},{"$f":" Time!K$103","v":"Pre-Fcst"},{"$f":" Time!L$103","v":"Forecast"},{"$f":" Time!M$103","v":"Forecast"},{"$f":" Time!N$103","v":"Forecast"},{"$f":" Time!O$103","v":"Forecast"},{"$f":" Time!P$103","v":"Forecast"},{"$f":" Time!Q$103","v":"Post-Fcst"},{"$f":" Time!R$103","v":"Post-Fcst"},{"$f":" Time!S$103","v":"Post-Fcst"}]
[null,null,null,null,{"$f":"Time!E126","v":"Financial year ending"},null,null,null,null,{"$f":" Time!J$126","v":2019},{"$f":" Time!K$126","v":2020},{"$f":" Time!L$126","v":2021},{"$f":" Time!M$126","v":2022},{"$f":" Time!N$126","v":2023},{"$f":" Time!O$126","v":2024},{"$f":" Time!P$126","v":2025},{"$f":" Time!Q$126","v":2026},{"$f":" Time!R$126","v":2027},{"$f":" Time!S$126","v":2028}]
[null,null,null,null,{"$f":"Time!E10","v":"Model column counter"},"Constant","Unit","Total",null,{"$f":" Time!J$10","v":1},{"$f":" Time!K$10","v":2},{"$f":" Time!L$10","v":3},{"$f":" Time!M$10","v":4},{"$f":" Time!N$10","v":5},{"$f":" Time!O$10","v":6},{"$f":" Time!P$10","v":7},{"$f":" Time!Q$10","v":8},{"$f":" Time!R$10","v":9},{"$f":" Time!S$10","v":10}]
[]
["A: TIME"]
[]
[null,"Timeline setup"]
[]
{"$rows_left_out":32}
{"sheet":"Calcs >>","index":7,"n_rows":0,"n_cols":0,"rows_kept":0,"cut":false,"hidden":false,"merged":[]}

{"sheet":"WINEP_Schemes","index":8,"n_rows":40,"n_cols":13,"rows_kept":40,"cut":false,"hidden":false,"merged":[]}
[{"$f":" RIGHT(CELL(\"filename\", $A$1), LEN(CELL(\"filename\", $A$1)) - SEARCH(\"]\", CELL(\"filename\", $A$1)))","v":"WINEP_Schemes"}]
[null,null,null,null,null,{"$f":"Check!F2","v":0},"Checks"]
[null,null,null,null,null,{"$f":"Check!F3","v":0},"Track chgs"]
[]
["AMBER WINEP SCHEMES"]
[]
[null,null,"List of WINEP schemes that were unconfirmed at FD"]
[]
[null,null,"WINEPID","Unique ID","Scheme category / name","Unit","Unit Conversion to £m",null,"Allowed totex unit rate","Quantity","1 = In plan\n0 = Not in plan","Proportion Confirmed","Price Control"]
[null,null,{"$f":" WINEP_Inputs!A5","v":"EX00001"},{"$f":" WINEP_Inputs!J5","v":"XXW000001"},{"$f":" WINEP_Inputs!K5","v":"Sample Fish Passage"},"£ per km LORI",{"$f":" 1 / InpActive!$F$37","v":9.9999999999999995E-7},null,{"$f":" WINEP_Inputs!CS5","v":30000},{"$f":" WINEP_Inputs!CR5","v":5},{"$f":" WINEP_Inputs!CT5","v":1},{"$f":" WINEP_Inputs!CU5","v":1},"WR"]
{"$rows_left_out":31}
{"sheet":"WINEP_Allowance","index":9,"n_rows":57,"n_cols":21,"rows_kept":57,"cut":false,"hidden":false,"merged":[]}
[{"$f":" RIGHT(CELL(\"filename\", $A$1), LEN(CELL(\"filename\", $A$1)) - SEARCH(\"]\", CELL(\"filename\", $A$1)))","v":"WINEP_Allowance"}]
[null,null,null,null,null,{"$f":"Check!F2","v":0},"Checks"]
[null,null,null,null,null,{"$f":"Check!F3","v":0},"Track chgs"]
[]
["CALCULATION OF ADJUSTED ALLOWED COST FOR CONFIRMED SCHEMES"]
[]
["List of Amber Schemes"]
[null,"Calculate the adjusted allowed cost per scheme, £m and the WINEP reconciliation per control, £m"]
[null,null,null,null,null,null,null,null,null,null,null,null,null,null,null,null,"WR","WN","WWN","BR","DMY"]
[null,null,{"$f":" WINEP_Schemes!C9","v":"WINEPID"},{"$f":" WINEP_Schemes!D9","v":"Unique ID"},{"$f":" WINEP_Schemes!E9","v":"Scheme category / name"},{"$f":" WINEP_Schemes!F9","v":"Unit"},{"$f":" WINEP_Schemes!G9","v":"Unit Conversion to £m"},{"$f":" WINEP_Schemes!H9","v":0},{"$f":"  WINEP_Schemes!I9","v":"Allowed totex unit rate"},{"$f":"  WINEP_Schemes!J9","v":"Quantity"},{"$f":"  WINEP_Schemes!K9","v":"1 = In plan\n0 = Not in plan"},{"$f":"  WINEP_Schemes!L9","v":"Proportion Confirmed"},{"$f":"  WINEP_Schemes!M9","v":"Price Control"},"FD Allowance, £m","Adjusted Allowance, £m","WINEP Reconciliation, £m","Water Resources £m","Water Network £m","Wastewater Network £m","Bioresources £m","Dummy £m"]
{"$rows_left_out":48}
{"sheet":"Outputs >>","index":10,"n_rows":0,"n_cols":0,"rows_kept":0,"cut":false,"hidden":false,"merged":[]}

{"sheet":"Annual_Outputs","index":11,"n_rows":33,"n_cols":11,"rows_kept":33,"cut":false,"hidden":false,"merged":[]}
[{"$f":" RIGHT(CELL(\"filename\", $A$1), LEN(CELL(\"filename\", $A$1)) - SEARCH(\"]\", CELL(\"filename\", $A$1)))","v":"Annual_Outputs"}]
[null,null,null,null,{"$f":"Time!E25","v":"Model period ending"},{"$f":"Check!F2","v":0},"Checks",null,{"$f":" Time!N$25","v":"2023-03-31"},{"$f":" Time!O$25","v":"2024-03-31"},{"$f":" Time!P$25","v":"2025-03-31"}]
[null,null,null,null,{"$f":"Time!E103","v":"Timeline label"},{"$f":"Check!F3","v":0},"Track chgs",null,{"$f":" Time!N$103","v":"Forecast"},{"$f":" Time!O$103","v":"Forecast"},{"$f":" Time!P$103","v":"Forecast"}]
[null,null,null,null,{"$f":"Time!E126","v":"Financial year ending"},null,null,null,{"$f":" Time!N$126","v":2023},{"$f":" Time!O$126","v":2024},{"$f":" Time!P$126","v":2025}]
[null,null,null,null,{"$f":"Time!E5","v":"Model column counter"},"Total","Unit",null,3,4,5]
[]
["ANNUAL ALLOWED COST"]
[]
["List of Amber Schemes"]
[null,"Calculate the final WINEP reconciliation, £m"]
{"$rows_left_out":24}
{"sheet":"F_Outputs","index":12,"n_rows":13,"n_cols":8,"rows_kept":13,"cut":false,"hidden":false,"merged":[]}
[null,null,"PR19FM007_WINEP_Out"]
["Acronym","Reference","Item description","Unit","Model","2022-23","2023-24","2024-25"]
[]
[null,"BoN",{"$f":" Annual_Outputs!E24","v":"WINEP Reconciliation, water resources"},"£m","Price Review 2019",{"$f":"Annual_Outputs!I24","v":-6.6666666666666645E-3},{"$f":"Annual_Outputs!J24","v":-6.6666666666666645E-3},{"$f":"Annual_Outputs!K24","v":-6.6666666666666645E-3}]
[null,"BoN",{"$f":" Annual_Outputs!E25","v":"WINEP Reconciliation, water network"},"£m","Price Review 2019",{"$f":"Annual_Outputs!I25","v":0},{"$f":"Annual_Outputs!J25","v":0},{"$f":"Annual_Outputs!K25","v":0}]
[null,"BoN",{"$f":" Annual_Outputs!E26","v":"WINEP Reconciliation, wastewater network"},"£m","Price Review 2019",{"$f":"Annual_Outputs!I26","v":-1.6666666666666667},{"$f":"Annual_Outputs!J26","v":-1.6666666666666667},{"$f":"Annual_Outputs!K26","v":-1.6666666666666667}]
[null,"BoN",{"$f":" Annual_Outputs!E27","v":"WINEP Reconciliation, bioresources"},"£m","Price Review 2019",{"$f":"Annual_Outputs!I27","v":0},{"$f":"Annual_Outputs!J27","v":0},{"$f":"Annual_Outputs!K27","v":0}]
[null,"BoN",{"$f":" Annual_Outputs!E28","v":"WINEP Reconciliation, dummy"},"£m","Price Review 2019",{"$f":"Annual_Outputs!I28","v":0},{"$f":"Annual_Outputs!J28","v":0},{"$f":"Annual_Outputs!K28","v":0}]
[null,"BoN_QA1","WINEP reconciliation model date stamp","text","Price Review 2019",{"$f":"CONCATENATE(\"[…]\", TEXT(NOW(), \"dd/mm/yyy hh:mm:ss\"))","v":"[…]02/09/2019 09:55:22"},"[…]02/09/2019 09:55:22","[…]02/09/2019 09:55:22"]
[null,"BoN_QA2","WINEP reconciliation model time stamp","text","Price Review 2019","[…]02/09/2019 09:55:22","[…]02/09/2019 09:55:22","[…]02/09/2019 09:55:22"]
{"$rows_left_out":4}
{"sheet":"QA >>","index":13,"n_rows":0,"n_cols":0,"rows_kept":0,"cut":false,"hidden":false,"merged":[]}

{"sheet":"Track","index":14,"n_rows":31,"n_cols":15,"rows_kept":31,"cut":false,"hidden":false,"merged":[]}
[{"$f":" RIGHT(CELL(\"filename\", $A$1), LEN(CELL(\"filename\", $A$1)) - SEARCH(\"]\", CELL(\"filename\", $A$1)))","v":"Track"},null,null,null,null,null,null,null,null,null,null,null,"do not del col",null,"do not del col"]
[null,null,null,null,null,{"$f":"Check!$F$2","v":0},"Checks",null,null,{"$f":" SUM(J7:J21)","v":0}]
[null,null,null,null,null,{"$f":"J2","v":0},"Track chgs"]
[]
[null,null,null,null,null,null,"Unit",null,null,{"$f":" MATCH($H$6, M6:O6, 0)","v":2},"Difference","Diff %"]
[null,null,null,null,"Comparison column label",null,null,"Nil inputs",null,null,null,null,null,"Nil inputs"]
[null,null,null,null,"[do not delete row]"]
["INPUTS"]
[null,null,null,null,null,null,null,null,null,{"$f":" IF(ABS(K9) > InpActive!$F$34, 1, 0)","v":0},{"$f":" H9 - INDEX(M9:O9, $J$5)","v":0},{"$f":" IF(ABS(K9) > InpActive!$F$34, IF(INDEX(M9:O9, $J$5) = 0, 0, H9 / INDEX(M9:O9, $J$5) - 1), 0)","v":0}]
[null,null,"Inputs",null,null,null,null,null,null,{"$f":" IF(ABS(K10) > InpActive!$F$34, 1, 0)","v":0},0,{"$f":" IF(ABS(K10) > InpActive!$F$34, IF(INDEX(M10:O10, $J$5) = 0, 0, H10 / INDEX(M10:O10, $J$5) - 1), 0)","v":0}]
{"$rows_left_out":22}
{"sheet":"Check","index":15,"n_rows":27,"n_cols":7,"rows_kept":27,"cut":false,"hidden":false,"merged":[]}
[{"$f":" RIGHT(CELL(\"filename\", $A$1), LEN(CELL(\"filename\", $A$1)) - SEARCH(\"]\", CELL(\"filename\", $A$1)))","v":"Check"}]
[null,null,null,null,null,{"$f":"F11","v":0},"Checks"]
[null,null,null,null,null,{"$f":"F24","v":0},"Track chgs"]
[]
[null,null,null,null,null,"Constant","Unit"]
[]
["CHECK SUMMARY"]
[]
["MODEL INTEGRITY CHECKS"]
[]
{"$rows_left_out":17}