{"text_format":"1","workbook":"xlsx","n_sheets":15,"sheets":["F_Inputs","InpOverride","InpActive","F_Outputs","Cover","Change Log","Map & Key","Inputs","Time","Indexation","Calc","Profiling","FM Proportion Calc","Summary_Output","Checks"],"not_rendered":{"charts":0,"images":1,"macros":0,"external_links":0,"defined_names":0,"comments":0,"pivot_tables":0},"unopened":[],"bounds":{"document_bytes":16777216,"sheet_cells":100000,"rows_first":2000,"rows_last":500,"rows_between":2000,"halvings":0,"cell_chars":16384,"cell_head_chars":4096},"cells_cut":0,"cells_raw":0,"read":"whole","date_system":"1900"}

{"sheet":"F_Inputs","index":0,"n_rows":59,"n_cols":18,"rows_kept":59,"cut":false,"hidden":false,"merged":[]}
[null,null,"PR19PD011_IN"]
["Acronym","Reference","Item description","Unit","Model","Price Review 2019"]
[]
[null,null,null,null,null,"PR19 Run 8: Final Determinations"]
[null,null,null,null,null,"Latest"]
[null,null,null,null,null,"2011-12","2012-13","2013-14","2014-15","2015-16","2016-17","2017-18","2018-19","2019-20","2020-21","2015-20","2014-20","PR19 application"]
["SWT","BB3905AL","Consumer Price Index (with housing) for April","nr","Price Review 2019",93.3,95.9,98,99.6,99.9,100.6,103.2,105.5,107.6,109.8]
["SWT","BB3905MY","Consumer Price Index (with housing) for May","nr","Price Review 2019",93.5,95.9,98.2,99.6,100.1,100.8,103.5,105.9,108,110.2]
{"$rows_left_out":52}
{"sheet":"InpOverride","index":1,"n_rows":59,"n_cols":19,"rows_kept":59,"cut":false,"hidden":false,"merged":[]}
[]
["Acronym","Reference","Item description","Unit","Model"]
[]
[]
[]
[null,null,null,null,null,"2011-12","2012-13","2013-14","2014-15","2015-16","2016-17","2017-18","2018-19","2019-20","2020-21","2015-20","2014-20","PR19 application","Action /\nIntervention\nreference"]
[{"$f":"F_Inputs!A7","v":"SWT"},"BB3905AL","Consumer Price Index (with housing) for April","nr","Price Review 2019"]
[{"$f":"F_Inputs!A8","v":"SWT"},"BB3905MY","Consumer Price Index (with housing) for May","nr","Price Review 2019"]
{"$rows_left_out":52}
{"sheet":"InpActive","index":2,"n_rows":59,"n_cols":18,"rows_kept":59,"cut":false,"hidden":false,"merged":[]}
[]
["Acronym","Reference","Item description","Unit","Model"]
[]
[]
[]
[null,null,null,null,null,"2011-12","2012-13","2013-14","2014-15","2015-16","2016-17","2017-18","2018-19","2019-20","2020-21","2015-20","2014-20","PR19 application"]
[{"$f":"F_Inputs!A7","v":"SWT"},"BB3905AL","Consumer Price Index (with housing) for April","nr","Price Review 2019",{"$f":"IF(InpOverride!F7=\"\",F_Inputs!F7,InpOverride!F7)","v":93.3},{"$f":"IF(InpOverride!G7=\"\",F_Inputs!G7,InpOverride!G7)","v":95.9},{"$f":"IF(InpOverride!H7=\"\",F_Inputs!H7,InpOverride!H7)","v":98},{"$f":"IF(InpOverride!I7=\"\",F_Inputs!I7,InpOverride!I7)","v":99.6},{"$f":"IF(InpOverride!J7=\"\",F_Inputs!J7,InpOverride!J7)","v":99.9},{"$f":"IF(InpOverride!K7=\"\",F_Inputs!K7,InpOverride!K7)","v":100.6},{"$f":"IF(InpOverride!L7=\"\",F_Inputs!L7,InpOverride!L7)","v":103.2},{"$f":"IF(InpOverride!M7=\"\",F_Inputs!M7,InpOverride!M7)","v":105.5},{"$f":"IF(InpOverride!N7=\"\",F_Inputs!N7,InpOverride!N7)","v":107.6},{"$f":"IF(InpOverride!O7=\"\",F_Inputs!O7,InpOverride!O7)","v":109.8}]
[{"$f":"F_Inputs!A8","v":"SWT"},"BB3905MY","Consumer Price Index (with housing) for May","nr","Price Review 2019",{"$f":"IF(InpOverride!F8=\"\",F_Inputs!F8,InpOverride!F8)","v":93.5},{"$f":"IF(InpOverride!G8=\"\",F_Inputs!G8,InpOverride!G8)","v":95.9},{"$f":"IF(InpOverride!H8=\"\",F_Inputs!H8,InpOverride!H8)","v":98.2},{"$f":"IF(InpOverride!I8=\"\",F_Inputs!I8,InpOverride!I8)","v":99.6},{"$f":"IF(InpOverride!J8=\"\",F_Inputs!J8,InpOverride!J8)","v":100.1},{"$f":"IF(InpOverride!K8=\"\",F_Inputs!K8,InpOverride!K8)","v":100.8},{"$f":"IF(InpOverride!L8=\"\",F_Inputs!L8,InpOverride!L8)","v":103.5},{"$f":"IF(InpOverride!M8=\"\",F_Inputs!M8,InpOverride!M8)","v":105.9},{"$f":"IF(InpOverride!N8=\"\",F_Inputs!N8,InpOverride!N8)","v":108},{"$f":"IF(InpOverride!O8=\"\",F_Inputs!O8,InpOverride!O8)","v":110.2}]
{"$rows_left_out":52}
{"sheet":"F_Outputs","index":3,"n_rows":103,"n_cols":11,"rows_kept":103,"cut":false,"hidden":false,"merged":[]}
[null,null,"PR19PD011Run06outputs"]
["Acronym","Reference","Item description","Unit","Model","PR19 application","2020-21","2021-22","2022-23","2023-24","2024-25"]
[]
[null,"C001_PR19PD011","1st model column start date","nr","Price Review 2019",{"$f":"Inputs!$F$13","v":41000}]
[null,"C002_PR19PD011","First modelling column financial year#","nr","Price Review 2019",{"$f":"Inputs!$F$16","v":2013}]
[null,"C003_PR19PD011","Financial year end month number","nr","Price Review 2019",{"$f":"Inputs!$F$17","v":3}]
[null,"C004_PR19PD011","Pre - forecast period","Text","Price Review 2019",{"$f":"Inputs!$F$20","v":"Pre-Fcst"}]
[null,"C005_PR19PD011","Forecast period","Text","Price Review 2019",{"$f":"Inputs!$F$21","v":"Forecast"}]
{"$rows_left_out":96}
{"sheet":"Cover","index":4,"n_rows":22,"n_cols":5,"rows_kept":22,"cut":false,"hidden":false,"merged":[[7,3,7,4]]}
[{"$f":" RIGHT(CELL(\"filename\", $A$1), LEN(CELL(\"filename\", $A$1)) - SEARCH(\"]\", CELL(\"filename\", $A$1)))","v":"Cover"}]
[]
[null,null,"Model name:","PR19 Revenue adjustments feeder model"]
[null,null,"Version number:","01o"]
[null,null,"Filename:",{"$f":" \"PR19 Revenue adjustments feeder model \" & D4 & \".xlsm\"","v":"PR19 Revenue adjustments feeder model 01o.xlsm"}]
[null,null,"Date:","2019-07-29"]
[null,null,"Author:","Ofwat and F1F9 UK Ltd"]
[null,null,"Author contact information:","PR19@ofwat.gsi.gov.uk"]
{"$rows_left_out":15}
{"sheet":"Change Log","index":5,"n_rows":15,"n_cols":6,"rows_kept":15,"cut":false,"hidden":false,"merged":[]}
["Change log"]
[]
[null,"#","Issue","Change","Sheet","Row"]
[]
["2017-12-01",1,"Company noted that the Ofwat feeder model incorrectly deflates prices from 2020 year end prices to 2017-18 financial year average prices by referencing the RPI March index value in the numerator.","Corrected calculation of the deflation factor to reference CPIH March 2020 index value.","Indexation",109]
["2017-12-01",2,"Companies noted differences in item labels between the Ofwat feeder model and the business plan tables ","Item labels have been aligned with the business plan tables","Calc\nProfiling\nSummary_Output"]
["2018-06-01",3,"In response to a query a new business plan table has been created. The Ofwat feeder model has been updated to reflect the additional table Dmmy10.","Include the Dummy10 revenue adjustment.","Inputs\nCalc\nSummary_Output"]
["2018-06-01",4,"Change email address","Changed from water2020 mailbox to PR19 mailbox","Cover"]
{"$rows_left_out":8}
{"sheet":"Map & Key","index":6,"n_rows":127,"n_cols":22,"rows_kept":127,"cut":false,"hidden":false,"merged":[]}
[{"$f":" RIGHT(CELL(\"filename\", $A$1), LEN(CELL(\"filename\", $A$1)) - SEARCH(\"]\", CELL(\"filename\", $A$1)))","v":"Map & Key"}]
[]
["GENERIC MODEL DESIGN"]
[]
[null,null,null,null,null,"ABOVE BONNET - USER INTERFACE"]
[]
[]
[null,null,null,null,null,null,null,"Inputs",null,null,null,null,null,null,null,"Output Summary"]
{"$rows_left_out":120}
{"sheet":"Inputs","index":7,"n_rows":169,"n_cols":22,"rows_kept":169,"cut":false,"hidden":false,"merged":[]}
[{"$f":" RIGHT(CELL(\"FILENAME\", $A$1), LEN(CELL(\"FILENAME\", $A$1)) - SEARCH(\"]\", CELL(\"FILENAME\", $A$1)))","v":"Inputs"}]
[null,null,null,null,{"$f":" Time!E$25","v":"Model period ending"},{"$f":"Checks!F$11","v":0},{"$f":"Checks!G$11","v":"Checks"},null,null,{"$f":" Time!J$25","v":"2013-03-31"},{"$f":" Time!K$25","v":"2014-03-31"},{"$f":" Time!L$25","v":"2015-03-31"},{"$f":" Time!M$25","v":"2016-03-31"},{"$f":" Time!N$25","v":"2017-03-31"},{"$f":" Time!O$25","v":"2018-03-31"},{"$f":" Time!P$25","v":"2019-03-31"},{"$f":" Time!Q$25","v":"2020-03-31"},{"$f":" Time!R$25","v":"2021-03-31"},{"$f":" Time!S$25","v":"2022-03-31"},{"$f":" Time!T$25","v":"2023-03-31"},{"$f":" Time!U$25","v":"2024-03-31"},{"$f":" Time!V$25","v":"2025-03-31"}]
[null,null,null,null,{"$f":" Time!E$80","v":"Timeline label"},null,null,null,null,{"$f":" Time!J$80","v":"Pre-Fcst"},{"$f":" Time!K$80","v":"Pre-Fcst"},{"$f":" Time!L$80","v":"Pre-Fcst"},{"$f":" Time!M$80","v":"Pre-Fcst"},{"$f":" Time!N$80","v":"Pre-Fcst"},{"$f":" Time!O$80","v":"Pre-Fcst"},{"$f":" Time!P$80","v":"Pre-Fcst"},{"$f":" Time!Q$80","v":"Pre-Fcst"},{"$f":" Time!R$80","v":"Forecast"},{"$f":" Time!S$80","v":"Forecast"},{"$f":" Time!T$80","v":"Forecast"},{"$f":" Time!U$80","v":"Forecast"},{"$f":" Time!V$80","v":"Forecast"}]
[null,null,null,null,{"$f":" Time!E$103","v":"Financial year ending"},null,null,null,null,{"$f":" Time!J$103","v":2013},{"$f":" Time!K$103","v":2014},{"$f":" Time!L$103","v":2015},{"$f":" Time!M$103","v":2016},{"$f":" Time!N$103","v":2017},{"$f":" Time!O$103","v":2018},{"$f":" Time!P$103","v":2019},{"$f":" Time!Q$103","v":2020},{"$f":" Time!R$103","v":2021},{"$f":" Time!S$103","v":2022},{"$f":" Time!T$103","v":2023},{"$f":" Time!U$103","v":2024},{"$f":" Time!V$103","v":2025}]
[{"$f":" IF(COUNTIF(A6:A169,\"< 0\") + COUNTIF(A6:A169,\">0\") <> 0, 1, 0)","v":0},null,null,"Input references",{"$f":" Time!E$10","v":"Model column counter"},"Constant","Unit","Total",null,{"$f":" Time!J$10","v":1},{"$f":" Time!K$10","v":2},{"$f":" Time!L$10","v":3},{"$f":" Time!M$10","v":4},{"$f":" Time!N$10","v":5},{"$f":" Time!O$10","v":6},{"$f":" Time!P$10","v":7},{"$f":" Time!Q$10","v":8},{"$f":" Time!R$10","v":9},{"$f":" Time!S$10","v":10},{"$f":" Time!T$10","v":11},{"$f":" Time!U$10","v":12},{"$f":" Time!V$10","v":13}]
[null,null,null,null,"[Used in formula range - Do not delete]"]
[]
["A: TIME"]
{"$rows_left_out":162}
{"sheet":"Time","index":8,"n_rows":103,"n_cols":22,"rows_kept":103,"cut":false,"hidden":false,"merged":[]}
[{"$f":" RIGHT(CELL(\"FILENAME\", $A$1), LEN(CELL(\"FILENAME\", $A$1)) - SEARCH(\"]\", CELL(\"FILENAME\", $A$1)))","v":"Time"}]
[null,null,null,null,{"$f":" Time!E$25","v":"Model period ending"},{"$f":"Checks!F$11","v":0},{"$f":"Checks!G$11","v":"Checks"},null,null,{"$f":" Time!J$25","v":"2013-03-31"},{"$f":" Time!K$25","v":"2014-03-31"},{"$f":" Time!L$25","v":"2015-03-31"},{"$f":" Time!M$25","v":"2016-03-31"},{"$f":" Time!N$25","v":"2017-03-31"},{"$f":" Time!O$25","v":"2018-03-31"},{"$f":" Time!P$25","v":"2019-03-31"},{"$f":" Time!Q$25","v":"2020-03-31"},{"$f":" Time!R$25","v":"2021-03-31"},{"$f":" Time!S$25","v":"2022-03-31"},{"$f":" Time!T$25","v":"2023-03-31"},{"$f":" Time!U$25","v":"2024-03-31"},{"$f":" Time!V$25","v":"2025-03-31"}]
[null,null,null,null,{"$f":" Time!E$80","v":"Timeline label"},null,null,null,null,{"$f":" Time!J$80","v":"Pre-Fcst"},{"$f":" Time!K$80","v":"Pre-Fcst"},{"$f":" Time!L$80","v":"Pre-Fcst"},{"$f":" Time!M$80","v":"Pre-Fcst"},{"$f":" Time!N$80","v":"Pre-Fcst"},{"$f":" Time!O$80","v":"Pre-Fcst"},{"$f":" Time!P$80","v":"Pre-Fcst"},{"$f":" Time!Q$80","v":"Pre-Fcst"},{"$f":" Time!R$80","v":"Forecast"},{"$f":" Time!S$80","v":"Forecast"},{"$f":" Time!T$80","v":"Forecast"},{"$f":" Time!U$80","v":"Forecast"},{"$f":" Time!V$80","v":"Forecast"}]
[null,null,null,null,{"$f":" Time!E$103","v":"Financial year ending"},null,null,null,null,{"$f":" Time!J$103","v":2013},{"$f":" Time!K$103","v":2014},{"$f":" Time!L$103","v":2015},{"$f":" Time!M$103","v":2016},{"$f":" Time!N$103","v":2017},{"$f":" Time!O$103","v":2018},{"$f":" Time!P$103","v":2019},{"$f":" Time!Q$103","v":2020},{"$f":" Time!R$103","v":2021},{"$f":" Time!S$103","v":2022},{"$f":" Time!T$103","v":2023},{"$f":" Time!U$103","v":2024},{"$f":" Time!V$103","v":2025}]
[null,null,null,null,{"$f":" Time!E$10","v":"Model column counter"},"Constant","Unit","Total",null,{"$f":" Time!J$10","v":1},{"$f":" Time!K$10","v":2},{"$f":" Time!L$10","v":3},{"$f":" Time!M$10","v":4},{"$f":" Time!N$10","v":5},{"$f":" Time!O$10","v":6},{"$f":" Time!P$10","v":7},{"$f":" Time!Q$10","v":8},{"$f":" Time!R$10","v":9},{"$f":" Time!S$10","v":10},{"$f":" Time!T$10","v":11},{"$f":" Time!U$10","v":12},{"$f":" Time!V$10","v":13}]
[]
["MODEL PERIOD"]
[]
{"$rows_left_out":96}
{"sheet":"Indexation","index":9,"n_rows":111,"n_cols":22,"rows_kept":111,"cut":false,"hidden":false,"merged":[]}
[{"$f":" RIGHT(CELL(\"filename\", $A$1), LEN(CELL(\"filename\", $A$1)) - SEARCH(\"]\", CELL(\"filename\", $A$1)))","v":"Indexation"}]
[null,null,null,null,{"$f":" Time!E$25","v":"Model period ending"},{"$f":"Checks!F$11","v":0},{"$f":"Checks!G$11","v":"Checks"},null,null,{"$f":" Time!J$25","v":"2013-03-31"},{"$f":" Time!K$25","v":"2014-03-31"},{"$f":" Time!L$25","v":"2015-03-31"},{"$f":" Time!M$25","v":"2016-03-31"},{"$f":" Time!N$25","v":"2017-03-31"},{"$f":" Time!O$25","v":"2018-03-31"},{"$f":" Time!P$25","v":"2019-03-31"},{"$f":" Time!Q$25","v":"2020-03-31"},{"$f":" Time!R$25","v":"2021-03-31"},{"$f":" Time!S$25","v":"2022-03-31"},{"$f":" Time!T$25","v":"2023-03-31"},{"$f":" Time!U$25","v":"2024-03-31"},{"$f":" Time!V$25","v":"2025-03-31"}]
[null,null,null,null,{"$f":" Time!E$80","v":"Timeline label"},null,null,null,null,{"$f":" Time!J$80","v":"Pre-Fcst"},{"$f":" Time!K$80","v":"Pre-Fcst"},{"$f":" Time!L$80","v":"Pre-Fcst"},{"$f":" Time!M$80","v":"Pre-Fcst"},{"$f":" Time!N$80","v":"Pre-Fcst"},{"$f":" Time!O$80","v":"Pre-Fcst"},{"$f":" Time!P$80","v":"Pre-Fcst"},{"$f":" Time!Q$80","v":"Pre-Fcst"},{"$f":" Time!R$80","v":"Forecast"},{"$f":" Time!S$80","v":"Forecast"},{"$f":" Time!T$80","v":"Forecast"},{"$f":" Time!U$80","v":"Forecast"},{"$f":" Time!V$80","v":"Forecast"}]
[null,null,null,null,{"$f":" Time!E$103","v":"Financial year ending"},null,null,null,null,{"$f":" Time!J$103","v":2013},{"$f":" Time!K$103","v":2014},{"$f":" Time!L$103","v":2015},{"$f":" Time!M$103","v":2016},{"$f":" Time!N$103","v":2017},{"$f":" Time!O$103","v":2018},{"$f":" Time!P$103","v":2019},{"$f":" Time!Q$103","v":2020},{"$f":" Time!R$103","v":2021},{"$f":" Time!S$103","v":2022},{"$f":" Time!T$103","v":2023},{"$f":" Time!U$103","v":2024},{"$f":" Time!V$103","v":2025}]
[null,null,null,null,{"$f":" Time!E$10","v":"Model column counter"},"Constant","Unit","Total",null,{"$f":" Time!J$10","v":1},{"$f":" Time!K$10","v":2},{"$f":" Time!L$10","v":3},{"$f":" Time!M$10","v":4},{"$f":" Time!N$10","v":5},{"$f":" Time!O$10","v":6},{"$f":" Time!P$10","v":7},{"$f":" Time!Q$10","v":8},{"$f":" Time!R$10","v":9},{"$f":" Time!S$10","v":10},{"$f":" Time!T$10","v":11},{"$f":" Time!U$10","v":12},{"$f":" Time!V$10","v":13}]
[]
["CPIH INDEXATION"]
[]
{"$rows_left_out":104}
{"sheet":"Calc","index":10,"n_rows":241,"n_cols":22,"rows_kept":241,"cut":false,"hidden":false,"merged":[]}
[{"$f":" RIGHT(CELL(\"filename\", $A$1), LEN(CELL(\"filename\", $A$1)) - SEARCH(\"]\", CELL(\"filename\", $A$1)))","v":"Calc"}]
[null,null,null,null,{"$f":" Time!E$25","v":"Model period ending"},{"$f":"Checks!F$11","v":0},{"$f":"Checks!G$11","v":"Checks"},null,null,{"$f":" Time!J$25","v":"2013-03-31"},{"$f":" Time!K$25","v":"2014-03-31"},{"$f":" Time!L$25","v":"2015-03-31"},{"$f":" Time!M$25","v":"2016-03-31"},{"$f":" Time!N$25","v":"2017-03-31"},{"$f":" Time!O$25","v":"2018-03-31"},{"$f":" Time!P$25","v":"2019-03-31"},{"$f":" Time!Q$25","v":"2020-03-31"},{"$f":" Time!R$25","v":"2021-03-31"},{"$f":" Time!S$25","v":"2022-03-31"},{"$f":" Time!T$25","v":"2023-03-31"},{"$f":" Time!U$25","v":"2024-03-31"},{"$f":" Time!V$25","v":"2025-03-31"}]
[null,null,null,null,{"$f":" Time!E$80","v":"Timeline label"},null,null,null,null,{"$f":" Time!J$80","v":"Pre-Fcst"},{"$f":" Time!K$80","v":"Pre-Fcst"},{"$f":" Time!L$80","v":"Pre-Fcst"},{"$f":" Time!M$80","v":"Pre-Fcst"},{"$f":" Time!N$80","v":"Pre-Fcst"},{"$f":" Time!O$80","v":"Pre-Fcst"},{"$f":" Time!P$80","v":"Pre-Fcst"},{"$f":" Time!Q$80","v":"Pre-Fcst"},{"$f":" Time!R$80","v":"Forecast"},{"$f":" Time!S$80","v":"Forecast"},{"$f":" Time!T$80","v":"Forecast"},{"$f":" Time!U$80","v":"Forecast"},{"$f":" Time!V$80","v":"Forecast"}]
[null,null,null,null,{"$f":" Time!E$103","v":"Financial year ending"},null,null,null,null,{"$f":" Time!J$103","v":2013},{"$f":" Time!K$103","v":2014},{"$f":" Time!L$103","v":2015},{"$f":" Time!M$103","v":2016},{"$f":" Time!N$103","v":2017},{"$f":" Time!O$103","v":2018},{"$f":" Time!P$103","v":2019},{"$f":" Time!Q$103","v":2020},{"$f":" Time!R$103","v":2021},{"$f":" Time!S$103","v":2022},{"$f":" Time!T$103","v":2023},{"$f":" Time!U$103","v":2024},{"$f":" Time!V$103","v":2025}]
[null,null,null,null,{"$f":" Time!E$10","v":"Model column counter"},"Constant","Unit","Total",null,{"$f":" Time!J$10","v":1},{"$f":" Time!K$10","v":2},{"$f":" Time!L$10","v":3},{"$f":" Time!M$10","v":4},{"$f":" Time!N$10","v":5},{"$f":" Time!O$10","v":6},{"$f":" Time!P$10","v":7},{"$f":" Time!Q$10","v":8},{"$f":" Time!R$10","v":9},{"$f":" Time!S$10","v":10},{"$f":" Time!T$10","v":11},{"$f":" Time!U$10","v":12},{"$f":" Time!V$10","v":13}]
[]
["WATER SERVICES INPUTS INFLATION"]
[]
{"$rows_left_out":234}
{"sheet":"Profiling","index":11,"n_rows":257,"n_cols":22,"rows_kept":257,"cut":false,"hidden":false,"merged":[]}
[{"$f":" RIGHT(CELL(\"filename\", $A$1), LEN(CELL(\"filename\", $A$1)) - SEARCH(\"]\", CELL(\"filename\", $A$1)))","v":"Profiling"}]
[null,null,null,null,{"$f":" Time!E$25","v":"Model period ending"},{"$f":"Checks!F$11","v":0},{"$f":"Checks!G$11","v":"Checks"},null,null,{"$f":" Time!J$25","v":"2013-03-31"},{"$f":" Time!K$25","v":"2014-03-31"},{"$f":" Time!L$25","v":"2015-03-31"},{"$f":" Time!M$25","v":"2016-03-31"},{"$f":" Time!N$25","v":"2017-03-31"},{"$f":" Time!O$25","v":"2018-03-31"},{"$f":" Time!P$25","v":"2019-03-31"},{"$f":" Time!Q$25","v":"2020-03-31"},{"$f":" Time!R$25","v":"2021-03-31"},{"$f":" Time!S$25","v":"2022-03-31"},{"$f":" Time!T$25","v":"2023-03-31"},{"$f":" Time!U$25","v":"2024-03-31"},{"$f":" Time!V$25","v":"2025-03-31"}]
[null,null,null,null,{"$f":" Time!E$80","v":"Timeline label"},null,null,null,null,{"$f":" Time!J$80","v":"Pre-Fcst"},{"$f":" Time!K$80","v":"Pre-Fcst"},{"$f":" Time!L$80","v":"Pre-Fcst"},{"$f":" Time!M$80","v":"Pre-Fcst"},{"$f":" Time!N$80","v":"Pre-Fcst"},{"$f":" Time!O$80","v":"Pre-Fcst"},{"$f":" Time!P$80","v":"Pre-Fcst"},{"$f":" Time!Q$80","v":"Pre-Fcst"},{"$f":" Time!R$80","v":"Forecast"},{"$f":" Time!S$80","v":"Forecast"},{"$f":" Time!T$80","v":"Forecast"},{"$f":" Time!U$80","v":"Forecast"},{"$f":" Time!V$80","v":"Forecast"}]
[null,null,null,null,{"$f":" Time!E$103","v":"Financial year ending"},null,null,null,null,{"$f":" Time!J$103","v":2013},{"$f":" Time!K$103","v":2014},{"$f":" Time!L$103","v":2015},{"$f":" Time!M$103","v":2016},{"$f":" Time!N$103","v":2017},{"$f":" Time!O$103","v":2018},{"$f":" Time!P$103","v":2019},{"$f":" Time!Q$103","v":2020},{"$f":" Time!R$103","v":2021},{"$f":" Time!S$103","v":2022},{"$f":" Time!T$103","v":2023},{"$f":" Time!U$103","v":2024},{"$f":" Time!V$103","v":2025}]
[null,null,null,null,{"$f":" Time!E$10","v":"Model column counter"},"Constant","Unit","Total",null,{"$f":" Time!J$10","v":1},{"$f":" Time!K$10","v":2},{"$f":" Time!L$10","v":3},{"$f":" Time!M$10","v":4},{"$f":" Time!N$10","v":5},{"$f":" Time!O$10","v":6},{"$f":" Time!P$10","v":7},{"$f":" Time!Q$10","v":8},{"$f":" Time!R$10","v":9},{"$f":" Time!S$10","v":10},{"$f":" Time!T$10","v":11},{"$f":" Time!U$10","v":12},{"$f":" Time!V$10","v":13}]
[]
["DISCOUNT RATE FOR 2021-25"]
[]
{"$rows_left_out":250}
{"sheet":"FM Proportion Calc","index":12,"n_rows":142,"n_cols":22,"rows_kept":142,"cut":false,"hidden":false,"merged":[]}
[{"$f":" RIGHT(CELL(\"filename\", $A$1), LEN(CELL(\"filename\", $A$1)) - SEARCH(\"]\", CELL(\"filename\", $A$1)))","v":"FM Proportion Calc"}]
[null,null,null,null,{"$f":" Time!E$25","v":"Model period ending"},{"$f":"Checks!F$11","v":0},{"$f":"Checks!G$11","v":"Checks"},null,null,{"$f":" Time!J$25","v":"2013-03-31"},{"$f":" Time!K$25","v":"2014-03-31"},{"$f":" Time!L$25","v":"2015-03-31"},{"$f":" Time!M$25","v":"2016-03-31"},{"$f":" Time!N$25","v":"2017-03-31"},{"$f":" Time!O$25","v":"2018-03-31"},{"$f":" Time!P$25","v":"2019-03-31"},{"$f":" Time!Q$25","v":"2020-03-31"},{"$f":" Time!R$25","v":"2021-03-31"},{"$f":" Time!S$25","v":"2022-03-31"},{"$f":" Time!T$25","v":"2023-03-31"},{"$f":" Time!U$25","v":"2024-03-31"},{"$f":" Time!V$25","v":"2025-03-31"}]
[null,null,null,null,{"$f":" Time!E$80","v":"Timeline label"},null,null,null,null,{"$f":" Time!J$80","v":"Pre-Fcst"},{"$f":" Time!K$80","v":"Pre-Fcst"},{"$f":" Time!L$80","v":"Pre-Fcst"},{"$f":" Time!M$80","v":"Pre-Fcst"},{"$f":" Time!N$80","v":"Pre-Fcst"},{"$f":" Time!O$80","v":"Pre-Fcst"},{"$f":" Time!P$80","v":"Pre-Fcst"},{"$f":" Time!Q$80","v":"Pre-Fcst"},{"$f":" Time!R$80","v":"Forecast"},{"$f":" Time!S$80","v":"Forecast"},{"$f":" Time!T$80","v":"Forecast"},{"$f":" Time!U$80","v":"Forecast"},{"$f":" Time!V$80","v":"Forecast"}]
[null,null,null,null,{"$f":" Time!E$103","v":"Financial year ending"},null,null,null,null,{"$f":" Time!J$103","v":2013},{"$f":" Time!K$103","v":2014},{"$f":" Time!L$103","v":2015},{"$f":" Time!M$103","v":2016},{"$f":" Time!N$103","v":2017},{"$f":" Time!O$103","v":2018},{"$f":" Time!P$103","v":2019},{"$f":" Time!Q$103","v":2020},{"$f":" Time!R$103","v":2021},{"$f":" Time!S$103","v":2022},{"$f":" Time!T$103","v":2023},{"$f":" Time!U$103","v":2024},{"$f":" Time!V$103","v":2025}]
[null,null,null,null,{"$f":" Time!E$10","v":"Model column counter"},"Constant","Unit",null,null,{"$f":" Time!J$10","v":1},{"$f":" Time!K$10","v":2},{"$f":" Time!L$10","v":3},{"$f":" Time!M$10","v":4},{"$f":" Time!N$10","v":5},{"$f":" Time!O$10","v":6},{"$f":" Time!P$10","v":7},{"$f":" Time!Q$10","v":8},{"$f":" Time!R$10","v":9},{"$f":" Time!S$10","v":10},{"$f":" Time!T$10","v":11},{"$f":" Time!U$10","v":12},{"$f":" Time!V$10","v":13}]
[]
["Water Resources"]
[]
{"$rows_left_out":135}
{"sheet":"Summary_Output","index":13,"n_rows":107,"n_cols":22,"rows_kept":107,"cut":false,"hidden":false,"merged":[]}
[{"$f":" RIGHT(CELL(\"filename\", $A$1), LEN(CELL(\"filename\", $A$1)) - SEARCH(\"]\", CELL(\"filename\", $A$1)))","v":"Summary_Output"}]
[null,null,null,null,{"$f":" Time!E$25","v":"Model period ending"},{"$f":"Checks!F$11","v":0},{"$f":"Checks!G$11","v":"Checks"},null,null,{"$f":" Time!J$25","v":"2013-03-31"},{"$f":" Time!K$25","v":"2014-03-31"},{"$f":" Time!L$25","v":"2015-03-31"},{"$f":" Time!M$25","v":"2016-03-31"},{"$f":" Time!N$25","v":"2017-03-31"},{"$f":" Time!O$25","v":"2018-03-31"},{"$f":" Time!P$25","v":"2019-03-31"},{"$f":" Time!Q$25","v":"2020-03-31"},{"$f":" Time!R$25","v":"2021-03-31"},{"$f":" Time!S$25","v":"2022-03-31"},{"$f":" Time!T$25","v":"2023-03-31"},{"$f":" Time!U$25","v":"2024-03-31"},{"$f":" Time!V$25","v":"2025-03-31"}]
[null,null,null,null,{"$f":" Time!E$80","v":"Timeline label"},null,null,null,null,{"$f":" Time!J$80","v":"Pre-Fcst"},{"$f":" Time!K$80","v":"Pre-Fcst"},{"$f":" Time!L$80","v":"Pre-Fcst"},{"$f":" Time!M$80","v":"Pre-Fcst"},{"$f":" Time!N$80","v":"Pre-Fcst"},{"$f":" Time!O$80","v":"Pre-Fcst"},{"$f":" Time!P$80","v":"Pre-Fcst"},{"$f":" Time!Q$80","v":"Pre-Fcst"},{"$f":" Time!R$80","v":"Forecast"},{"$f":" Time!S$80","v":"Forecast"},{"$f":" Time!T$80","v":"Forecast"},{"$f":" Time!U$80","v":"Forecast"},{"$f":" Time!V$80","v":"Forecast"}]
[null,null,null,null,{"$f":" Time!E$103","v":"Financial year ending"},null,null,null,null,{"$f":" Time!J$103","v":2013},{"$f":" Time!K$103","v":2014},{"$f":" Time!L$103","v":2015},{"$f":" Time!M$103","v":2016},{"$f":" Time!N$103","v":2017},{"$f":" Time!O$103","v":2018},{"$f":" Time!P$103","v":2019},{"$f":" Time!Q$103","v":2020},{"$f":" Time!R$103","v":2021},{"$f":" Time!S$103","v":2022},{"$f":" Time!T$103","v":2023},{"$f":" Time!U$103","v":2024},{"$f":" Time!V$103","v":2025}]
[null,null,null,null,{"$f":" Time!E$10","v":"Model column counter"},"Constant","Unit",null,null,{"$f":" Time!J$10","v":1},{"$f":" Time!K$10","v":2},{"$f":" Time!L$10","v":3},{"$f":" Time!M$10","v":4},{"$f":" Time!N$10","v":5},{"$f":" Time!O$10","v":6},{"$f":" Time!P$10","v":7},{"$f":" Time!Q$10","v":8},{"$f":" Time!R$10","v":9},{"$f":" Time!S$10","v":10},{"$f":" Time!T$10","v":11},{"$f":" Time!U$10","v":12},{"$f":" Time!V$10","v":13}]
[]
["PR14 REVENUE RECONCILIATION ADJUSTMENTS EXPRESSED IN 2017/18 FYA CPIH DEFLATED PRICE BASE BY TABLE"]
[]
{"$rows_left_out":100}
{"sheet":"Checks","index":14,"n_rows":24,"n_cols":7,"rows_kept":24,"cut":false,"hidden":false,"merged":[]}
[{"$f":" RIGHT(CELL(\"filename\", $A$1), LEN(CELL(\"filename\", $A$1)) - SEARCH(\"]\", CELL(\"filename\", $A$1)))","v":"Checks"}]
[null,null,null,null,{"$f":" Time!E$25","v":"Model period ending"},{"$f":"Checks!F$11","v":0},{"$f":"Checks!G$11","v":"Checks"}]
[null,null,null,null,{"$f":" Time!E$80","v":"Timeline label"}]
[null,null,null,null,{"$f":" Time!E$103","v":"Financial year ending"}]
[null,null,null,null,{"$f":" Time!E$10","v":"Model column counter"},"Constant","Unit"]
[]
["CHECK SUMMARY"]
[]
{"$rows_left_out":16}