{"text_format":"1","workbook":"xlsx","n_sheets":12,"sheets":["F_Inputs","InpOverride","InpActive","F_Outputs","Cover","Change Log","Map & Key","Inputs","Time","Indexation","Calc","Summary_Output"],"not_rendered":{"charts":0,"images":1,"macros":1,"external_links":0,"defined_names":0,"comments":0,"pivot_tables":0},"unopened":[],"bounds":{"document_bytes":16777216,"sheet_cells":100000,"rows_first":2000,"rows_last":500,"rows_between":2000,"halvings":0,"cell_chars":16384,"cell_head_chars":4096},"cells_cut":0,"cells_raw":0,"read":"whole","date_system":"1900"}

{"sheet":"F_Inputs","index":0,"n_rows":60,"n_cols":18,"rows_kept":60,"cut":false,"hidden":false,"merged":[]}
[null,null,"PR19PD010_IN"]
["Acronym","Reference","Item description","Unit","Model","Price Review 2019"]
[]
[null,null,null,null,null,"BYRun1: Blind Year DD"]
[null,null,null,null,null,"Latest"]
[null,null,null,null,null,"2011-12","2012-13","2013-14","2014-15","2015-16","2016-17","2017-18","2018-19","2019-20","2020-21","2015-20","2014-20","PR19 application"]
["YKY","BB3905AL","Consumer Price Index (with housing) for April","nr","Price Review 2019",93.3,95.9,98,99.6,99.9,100.6,103.2,105.5,107.6]
["YKY","BB3905MY","Consumer Price Index (with housing) for May","nr","Price Review 2019",93.5,95.9,98.2,99.6,100.1,100.8,103.5,105.9,107.9]
["YKY","BB3905JN","Consumer Price Index (with housing) for June","nr","Price Review 2019",93.5,95.6,98,99.8,100.1,101,103.5,105.9,107.9]
["YKY","BB3905JL","Consumer Price Index (with housing) for July","nr","Price Review 2019",93.5,95.7,98,99.6,100,100.9,103.5,105.9,108]
{"$rows_left_out":51}
{"sheet":"InpOverride","index":1,"n_rows":60,"n_cols":19,"rows_kept":60,"cut":false,"hidden":false,"merged":[]}
[null,null,"PR19PD010_IN"]
["Acronym","Reference","Item description","Unit","Model","Price Review 2019"]
[]
[null,null,null,null,null,"PR19 Run 6: Fast Track DD"]
[null,null,null,null,null,"Latest"]
[null,null,null,null,null,"2011-12","2012-13","2013-14","2014-15","2015-16","2016-17","2017-18","2018-19","2019-20","2020-21","2015-20","2014-20","PR19 application","Action /\nIntervention\nreference"]
[{"$f":"F_Inputs!A7","v":"YKY"},"BB3905AL","Consumer Price Index (with housing) for April","nr","Price Review 2019"]
[{"$f":"F_Inputs!A8","v":"YKY"},"BB3905MY","Consumer Price Index (with housing) for May","nr","Price Review 2019"]
[{"$f":"F_Inputs!A9","v":"YKY"},"BB3905JN","Consumer Price Index (with housing) for June","nr","Price Review 2019"]
[{"$f":"F_Inputs!A10","v":"YKY"},"BB3905JL","Consumer Price Index (with housing) for July","nr","Price Review 2019"]
{"$rows_left_out":51}
{"sheet":"InpActive","index":2,"n_rows":60,"n_cols":18,"rows_kept":60,"cut":false,"hidden":false,"merged":[]}
[null,null,"PR19PD010_IN"]
["Acronym","Reference","Item description","Unit","Model","Price Review 2019"]
[]
[null,null,null,null,null,"PR19 Run 6: Fast Track DD"]
[null,null,null,null,null,"Latest"]
[null,null,null,null,null,"2011-12","2012-13","2013-14","2014-15","2015-16","2016-17","2017-18","2018-19","2019-20","2020-21","2015-20","2014-20","PR19 application"]
[{"$f":"F_Inputs!A7","v":"YKY"},"BB3905AL","Consumer Price Index (with housing) for April","nr","Price Review 2019",{"$f":"IF(InpOverride!F7=\"\",F_Inputs!F7,InpOverride!F7)","v":93.3},{"$f":"IF(InpOverride!G7=\"\",F_Inputs!G7,InpOverride!G7)","v":95.9},{"$f":"IF(InpOverride!H7=\"\",F_Inputs!H7,InpOverride!H7)","v":98},{"$f":"IF(InpOverride!I7=\"\",F_Inputs!I7,InpOverride!I7)","v":99.6},{"$f":"IF(InpOverride!J7=\"\",F_Inputs!J7,InpOverride!J7)","v":99.9},{"$f":"IF(InpOverride!K7=\"\",F_Inputs!K7,InpOverride!K7)","v":100.6},{"$f":"IF(InpOverride!L7=\"\",F_Inputs!L7,InpOverride!L7)","v":103.2},{"$f":"IF(InpOverride!M7=\"\",F_Inputs!M7,InpOverride!M7)","v":105.5},{"$f":"IF(InpOverride!N7=\"\",F_Inputs!N7,InpOverride!N7)","v":107.6},{"$f":"IF(InpOverride!O7=\"\",F_Inputs!O7,InpOverride!O7)","v":0}]
[{"$f":"F_Inputs!A8","v":"YKY"},"BB3905MY","Consumer Price Index (with housing) for May","nr","Price Review 2019",{"$f":"IF(InpOverride!F8=\"\",F_Inputs!F8,InpOverride!F8)","v":93.5},{"$f":"IF(InpOverride!G8=\"\",F_Inputs!G8,InpOverride!G8)","v":95.9},{"$f":"IF(InpOverride!H8=\"\",F_Inputs!H8,InpOverride!H8)","v":98.2},{"$f":"IF(InpOverride!I8=\"\",F_Inputs!I8,InpOverride!I8)","v":99.6},{"$f":"IF(InpOverride!J8=\"\",F_Inputs!J8,InpOverride!J8)","v":100.1},{"$f":"IF(InpOverride!K8=\"\",F_Inputs!K8,InpOverride!K8)","v":100.8},{"$f":"IF(InpOverride!L8=\"\",F_Inputs!L8,InpOverride!L8)","v":103.5},{"$f":"IF(InpOverride!M8=\"\",F_Inputs!M8,InpOverride!M8)","v":105.9},{"$f":"IF(InpOverride!N8=\"\",F_Inputs!N8,InpOverride!N8)","v":107.9},{"$f":"IF(InpOverride!O8=\"\",F_Inputs!O8,InpOverride!O8)","v":0}]
[{"$f":"F_Inputs!A9","v":"YKY"},"BB3905JN","Consumer Price Index (with housing) for June","nr","Price Review 2019",{"$f":"IF(InpOverride!F9=\"\",F_Inputs!F9,InpOverride!F9)","v":93.5},{"$f":"IF(InpOverride!G9=\"\",F_Inputs!G9,InpOverride!G9)","v":95.6},{"$f":"IF(InpOverride!H9=\"\",F_Inputs!H9,InpOverride!H9)","v":98},{"$f":"IF(InpOverride!I9=\"\",F_Inputs!I9,InpOverride!I9)","v":99.8},{"$f":"IF(InpOverride!J9=\"\",F_Inputs!J9,InpOverride!J9)","v":100.1},{"$f":"IF(InpOverride!K9=\"\",F_Inputs!K9,InpOverride!K9)","v":101},{"$f":"IF(InpOverride!L9=\"\",F_Inputs!L9,InpOverride!L9)","v":103.5},{"$f":"IF(InpOverride!M9=\"\",F_Inputs!M9,InpOverride!M9)","v":105.9},{"$f":"IF(InpOverride!N9=\"\",F_Inputs!N9,InpOverride!N9)","v":107.9},{"$f":"IF(InpOverride!O9=\"\",F_Inputs!O9,InpOverride!O9)","v":0}]
[{"$f":"F_Inputs!A10","v":"YKY"},"BB3905JL","Consumer Price Index (with housing) for July","nr","Price Review 2019",{"$f":"IF(InpOverride!F10=\"\",F_Inputs!F10,InpOverride!F10)","v":93.5},{"$f":"IF(InpOverride!G10=\"\",F_Inputs!G10,InpOverride!G10)","v":95.7},{"$f":"IF(InpOverride!H10=\"\",F_Inputs!H10,InpOverride!H10)","v":98},{"$f":"IF(InpOverride!I10=\"\",F_Inputs!I10,InpOverride!I10)","v":99.6},{"$f":"IF(InpOverride!J10=\"\",F_Inputs!J10,InpOverride!J10)","v":100},{"$f":"IF(InpOverride!K10=\"\",F_Inputs!K10,InpOverride!K10)","v":100.9},{"$f":"IF(InpOverride!L10=\"\",F_Inputs!L10,InpOverride!L10)","v":103.5},{"$f":"IF(InpOverride!M10=\"\",F_Inputs!M10,InpOverride!M10)","v":105.9},{"$f":"IF(InpOverride!N10=\"\",F_Inputs!N10,InpOverride!N10)","v":108},{"$f":"IF(InpOverride!O10=\"\",F_Inputs!O10,InpOverride!O10)","v":0}]
{"$rows_left_out":51}
{"sheet":"F_Outputs","index":3,"n_rows":92,"n_cols":8,"rows_kept":92,"cut":false,"hidden":false,"merged":[]}
[null,null,"PR19PD010SVEBYDD"]
["Acronym","Reference","Item description","Unit","Model","2019-20","2020-21","PR19 application"]
[]
[null,"C001_PR19PD010","1st model column start date","nr","Price Review 2019",null,null,{"$f":"Inputs!$F$13","v":41000}]
[null,"C002_PR19PD010","First modelling column financial year#","nr","Price Review 2019",null,null,{"$f":"Inputs!$F$16","v":2013}]
[null,"C003_PR19PD010","Financial year end month number","nr","Price Review 2019",null,null,{"$f":"Inputs!$F$17","v":3}]
[null,"C004_PR19PD010","Pre - forecast period","Text","Price Review 2019",null,null,{"$f":"Inputs!$F$20","v":"Pre-Fcst"}]
[null,"C005_PR19PD010","Forecast period","Text","Price Review 2019",null,null,{"$f":"Inputs!$F$21","v":"Forecast"}]
[null,"C006_PR19PD010","Post - forecast period","Text","Price Review 2019",null,null,{"$f":"Inputs!$F$22","v":"Post-Fcst"}]
[null,"C007_PR19PD010","Forecast start date","nr","Price Review 2019",null,null,{"$f":"Inputs!$F$26","v":43922}]
{"$rows_left_out":83}
{"sheet":"Cover","index":4,"n_rows":20,"n_cols":4,"rows_kept":20,"cut":false,"hidden":false,"merged":[[7,3,7,4]]}
[{"$f":" RIGHT(CELL(\"filename\", $A$1), LEN(CELL(\"filename\", $A$1)) - SEARCH(\"]\", CELL(\"filename\", $A$1)))","v":"Cover"}]
[]
[null,null,"Model name:","PR19 RCV adjustments feeder model"]
[null,null,"Version number:","01v"]
[null,null,"Filename:",{"$f":" \"PR19 RCV adjustments feeder model \" & D4 & \".xlsm\"","v":"PR19 RCV adjustments feeder model 01v.xlsm"}]
[null,null,"Date:","2020-08-24"]
[null,null,"Author:","Ofwat and F1F9 UK Ltd"]
[null,null,"Author contact information:","PR19@ofwat.gsi.gov.uk"]
[]
[]
{"$rows_left_out":11}
{"sheet":"Change Log","index":5,"n_rows":19,"n_cols":6,"rows_kept":19,"cut":false,"hidden":false,"merged":[]}
["Change log"]
[]
[null,"#","Issue","Change","Sheet","Row"]
[]
["2017-12-01",1,"Company noted that the Ofwat feeder model incorrectly deflates prices from 2020 year end prices to 2017-18 financial year average prices by referencing the RPI March index value in the numerator.","Corrected calculation of the deflation factor to reference CPIH March 2020 index value.","Indexation",102]
["2017-12-01",2,"Companies noted differences in item labels between the Ofwat feeder model and the business plan tables ","Item labels have been aligned with the business plan tables","Calc\nSummary_Output"]
["2017-12-01",3,"Some business plan tables require RCV items in 2017-18 FYE (financial year end) CPIH deflated price base.  ","Add 2017-18 FYE CPIH deflation factor","Indexation",105]
["2017-12-01",4,"Some business plan tables require RCV items in 2017-18 FYE (financial year end) CPIH deflated price base.  ","Add the 2017-18 FYE CPIH deflated items to the Calc and Summary_Output sheet","Calc\nSummary_Output"]
["2018-06-01",5,"Line descriptions for the CIS RCV inflation correction items are not consistent with business plan tables.","Item labels have been aligned with the business plan tables App8 and App25.","Inputs\nCalc\nSummary_Output"]
["2018-06-01",6,"IN 18/09 Guidance for reporting operating leases in PR19 business plans.\nThe RCV adjustment calculated for each wholesale control in business plan table App33 flows to business plan table App8. The RCV adjustments feeder model has been updated to reflect the revisions to table App8.","Include the new IFRS16 related RCV adjustments in the calculation of the opening balances for the 2020 RCV RPI inflated and 2020 RCV CPIH inflated RCV.","Inputs\nIndexation\nCalc\nSummary_Output"]
{"$rows_left_out":10}
{"sheet":"Map & Key","index":6,"n_rows":121,"n_cols":22,"rows_kept":121,"cut":false,"hidden":false,"merged":[]}
[{"$f":" RIGHT(CELL(\"filename\", $A$1), LEN(CELL(\"filename\", $A$1)) - SEARCH(\"]\", CELL(\"filename\", $A$1)))","v":"Map & Key"}]
[]
["GENERIC MODEL DESIGN"]
[]
[null,null,null,null,null,"ABOVE BONNET - USER INTERFACE"]
[]
[]
[null,null,null,null,null,null,null,"Inputs",null,null,null,null,null,null,null,"Output Summary"]
[]
[]
{"$rows_left_out":112}
{"sheet":"Inputs","index":7,"n_rows":140,"n_cols":21,"rows_kept":140,"cut":false,"hidden":false,"merged":[]}
[{"$f":" RIGHT(CELL(\"FILENAME\", $A$1), LEN(CELL(\"FILENAME\", $A$1)) - SEARCH(\"]\", CELL(\"FILENAME\", $A$1)))","v":"Inputs"}]
[null,null,null,null,{"$f":" Time!E$25","v":"Model period ending"},null,null,null,null,{"$f":" Time!J$25","v":"2013-03-31"},{"$f":" Time!K$25","v":"2014-03-31"},{"$f":" Time!L$25","v":"2015-03-31"},{"$f":" Time!M$25","v":"2016-03-31"},{"$f":" Time!N$25","v":"2017-03-31"},{"$f":" Time!O$25","v":"2018-03-31"},{"$f":" Time!P$25","v":"2019-03-31"},{"$f":" Time!Q$25","v":"2020-03-31"},{"$f":" Time!R$25","v":"2021-03-31"},{"$f":" Time!S$25","v":"2022-03-31"},{"$f":" Time!T$25","v":"2023-03-31"},{"$f":" Time!U$25","v":"2024-03-31"}]
[null,null,null,null,{"$f":" Time!E$80","v":"Timeline label"},null,null,null,null,{"$f":" Time!J$80","v":"Pre-Fcst"},{"$f":" Time!K$80","v":"Pre-Fcst"},{"$f":" Time!L$80","v":"Pre-Fcst"},{"$f":" Time!M$80","v":"Pre-Fcst"},{"$f":" Time!N$80","v":"Pre-Fcst"},{"$f":" Time!O$80","v":"Pre-Fcst"},{"$f":" Time!P$80","v":"Pre-Fcst"},{"$f":" Time!Q$80","v":"Pre-Fcst"},{"$f":" Time!R$80","v":"Forecast"},{"$f":" Time!S$80","v":"Forecast"},{"$f":" Time!T$80","v":"Forecast"},{"$f":" Time!U$80","v":"Forecast"}]
[null,null,null,null,{"$f":" Time!E$103","v":"Financial year ending"},null,null,null,null,{"$f":" Time!J$103","v":2013},{"$f":" Time!K$103","v":2014},{"$f":" Time!L$103","v":2015},{"$f":" Time!M$103","v":2016},{"$f":" Time!N$103","v":2017},{"$f":" Time!O$103","v":2018},{"$f":" Time!P$103","v":2019},{"$f":" Time!Q$103","v":2020},{"$f":" Time!R$103","v":2021},{"$f":" Time!S$103","v":2022},{"$f":" Time!T$103","v":2023},{"$f":" Time!U$103","v":2024}]
[{"$f":" IF(COUNTIF(A6:A140,\"< 0\") + COUNTIF(A6:A140,\">0\") <> 0, 1, 0)","v":0},null,null,"Input references",{"$f":" Time!E$10","v":"Model column counter"},"Constant","Unit","Total",null,{"$f":" Time!J$10","v":1},{"$f":" Time!K$10","v":2},{"$f":" Time!L$10","v":3},{"$f":" Time!M$10","v":4},{"$f":" Time!N$10","v":5},{"$f":" Time!O$10","v":6},{"$f":" Time!P$10","v":7},{"$f":" Time!Q$10","v":8},{"$f":" Time!R$10","v":9},{"$f":" Time!S$10","v":10},{"$f":" Time!T$10","v":11},{"$f":" Time!U$10","v":12}]
[null,null,null,null,"[Used in formula range - Do not delete]"]
[]
["A: TIME"]
[]
[null,"Timeline setup"]
{"$rows_left_out":131}
{"sheet":"Time","index":8,"n_rows":103,"n_cols":21,"rows_kept":103,"cut":false,"hidden":false,"merged":[]}
[{"$f":" RIGHT(CELL(\"FILENAME\", $A$1), LEN(CELL(\"FILENAME\", $A$1)) - SEARCH(\"]\", CELL(\"FILENAME\", $A$1)))","v":"Time"}]
[null,null,null,null,{"$f":" Time!E$25","v":"Model period ending"},null,null,null,null,{"$f":" Time!J$25","v":"2013-03-31"},{"$f":" Time!K$25","v":"2014-03-31"},{"$f":" Time!L$25","v":"2015-03-31"},{"$f":" Time!M$25","v":"2016-03-31"},{"$f":" Time!N$25","v":"2017-03-31"},{"$f":" Time!O$25","v":"2018-03-31"},{"$f":" Time!P$25","v":"2019-03-31"},{"$f":" Time!Q$25","v":"2020-03-31"},{"$f":" Time!R$25","v":"2021-03-31"},{"$f":" Time!S$25","v":"2022-03-31"},{"$f":" Time!T$25","v":"2023-03-31"},{"$f":" Time!U$25","v":"2024-03-31"}]
[null,null,null,null,{"$f":" Time!E$80","v":"Timeline label"},null,null,null,null,{"$f":" Time!J$80","v":"Pre-Fcst"},{"$f":" Time!K$80","v":"Pre-Fcst"},{"$f":" Time!L$80","v":"Pre-Fcst"},{"$f":" Time!M$80","v":"Pre-Fcst"},{"$f":" Time!N$80","v":"Pre-Fcst"},{"$f":" Time!O$80","v":"Pre-Fcst"},{"$f":" Time!P$80","v":"Pre-Fcst"},{"$f":" Time!Q$80","v":"Pre-Fcst"},{"$f":" Time!R$80","v":"Forecast"},{"$f":" Time!S$80","v":"Forecast"},{"$f":" Time!T$80","v":"Forecast"},{"$f":" Time!U$80","v":"Forecast"}]
[null,null,null,null,{"$f":" Time!E$103","v":"Financial year ending"},null,null,null,null,{"$f":" Time!J$103","v":2013},{"$f":" Time!K$103","v":2014},{"$f":" Time!L$103","v":2015},{"$f":" Time!M$103","v":2016},{"$f":" Time!N$103","v":2017},{"$f":" Time!O$103","v":2018},{"$f":" Time!P$103","v":2019},{"$f":" Time!Q$103","v":2020},{"$f":" Time!R$103","v":2021},{"$f":" Time!S$103","v":2022},{"$f":" Time!T$103","v":2023},{"$f":" Time!U$103","v":2024}]
[null,null,null,null,{"$f":" Time!E$10","v":"Model column counter"},"Constant","Unit","Total",null,{"$f":" Time!J$10","v":1},{"$f":" Time!K$10","v":2},{"$f":" Time!L$10","v":3},{"$f":" Time!M$10","v":4},{"$f":" Time!N$10","v":5},{"$f":" Time!O$10","v":6},{"$f":" Time!P$10","v":7},{"$f":" Time!Q$10","v":8},{"$f":" Time!R$10","v":9},{"$f":" Time!S$10","v":10},{"$f":" Time!T$10","v":11},{"$f":" Time!U$10","v":12}]
[]
["MODEL PERIOD"]
[]
[null,"Model column counter "]
[null,null,null,null,"Model column counter",null,"counter",null,null,{"$f":" I10 + 1","v":1},2,3,4,5,6,7,8,9,{"$f":" R10 + 1","v":10},{"$f":" S10 + 1","v":11},{"$f":" T10 + 1","v":12}]
{"$rows_left_out":94}
{"sheet":"Indexation","index":9,"n_rows":107,"n_cols":21,"rows_kept":107,"cut":false,"hidden":false,"merged":[]}
[{"$f":" RIGHT(CELL(\"filename\", $A$1), LEN(CELL(\"filename\", $A$1)) - SEARCH(\"]\", CELL(\"filename\", $A$1)))","v":"Indexation"}]
[null,null,null,null,{"$f":" Time!E$25","v":"Model period ending"},null,null,null,null,{"$f":" Time!J$25","v":"2013-03-31"},{"$f":" Time!K$25","v":"2014-03-31"},{"$f":" Time!L$25","v":"2015-03-31"},{"$f":" Time!M$25","v":"2016-03-31"},{"$f":" Time!N$25","v":"2017-03-31"},{"$f":" Time!O$25","v":"2018-03-31"},{"$f":" Time!P$25","v":"2019-03-31"},{"$f":" Time!Q$25","v":"2020-03-31"},{"$f":" Time!R$25","v":"2021-03-31"},{"$f":" Time!S$25","v":"2022-03-31"},{"$f":" Time!T$25","v":"2023-03-31"},{"$f":" Time!U$25","v":"2024-03-31"}]
[null,null,null,null,{"$f":" Time!E$80","v":"Timeline label"},null,null,null,null,{"$f":" Time!J$80","v":"Pre-Fcst"},{"$f":" Time!K$80","v":"Pre-Fcst"},{"$f":" Time!L$80","v":"Pre-Fcst"},{"$f":" Time!M$80","v":"Pre-Fcst"},{"$f":" Time!N$80","v":"Pre-Fcst"},{"$f":" Time!O$80","v":"Pre-Fcst"},{"$f":" Time!P$80","v":"Pre-Fcst"},{"$f":" Time!Q$80","v":"Pre-Fcst"},{"$f":" Time!R$80","v":"Forecast"},{"$f":" Time!S$80","v":"Forecast"},{"$f":" Time!T$80","v":"Forecast"},{"$f":" Time!U$80","v":"Forecast"}]
[null,null,null,null,{"$f":" Time!E$103","v":"Financial year ending"},null,null,null,null,{"$f":" Time!J$103","v":2013},{"$f":" Time!K$103","v":2014},{"$f":" Time!L$103","v":2015},{"$f":" Time!M$103","v":2016},{"$f":" Time!N$103","v":2017},{"$f":" Time!O$103","v":2018},{"$f":" Time!P$103","v":2019},{"$f":" Time!Q$103","v":2020},{"$f":" Time!R$103","v":2021},{"$f":" Time!S$103","v":2022},{"$f":" Time!T$103","v":2023},{"$f":" Time!U$103","v":2024}]
[null,null,null,null,{"$f":" Time!E$10","v":"Model column counter"},"Constant","Unit","Total",null,{"$f":" Time!J$10","v":1},{"$f":" Time!K$10","v":2},{"$f":" Time!L$10","v":3},{"$f":" Time!M$10","v":4},{"$f":" Time!N$10","v":5},{"$f":" Time!O$10","v":6},{"$f":" Time!P$10","v":7},{"$f":" Time!Q$10","v":8},{"$f":" Time!R$10","v":9},{"$f":" Time!S$10","v":10},{"$f":" Time!T$10","v":11},{"$f":" Time!U$10","v":12}]
[]
["CPIH INDEXATION"]
[]
[null,"CPIH: Index value series"]
[null,null,null,null,{"$f":" Inputs!E$35","v":"Consumer Price Index for April"},{"$f":" Inputs!F$35","v":0},{"$f":" Inputs!G$35","v":"index"},{"$f":" Inputs!H$35","v":0},{"$f":" Inputs!I$35","v":0},{"$f":" Inputs!J$35","v":95.9},{"$f":" Inputs!K$35","v":98},{"$f":" Inputs!L$35","v":99.6},{"$f":" Inputs!M$35","v":99.9},{"$f":" Inputs!N$35","v":100.6},{"$f":" Inputs!O$35","v":103.2},{"$f":" Inputs!P$35","v":105.5},{"$f":" Inputs!Q$35","v":107.6},{"$f":" Inputs!R$35","v":0},{"$f":" Inputs!S$35","v":0},{"$f":" Inputs!T$35","v":0},{"$f":" Inputs!U$35","v":0}]
{"$rows_left_out":98}
{"sheet":"Calc","index":10,"n_rows":473,"n_cols":21,"rows_kept":473,"cut":false,"hidden":false,"merged":[]}
[{"$f":" RIGHT(CELL(\"filename\", $A$1), LEN(CELL(\"filename\", $A$1)) - SEARCH(\"]\", CELL(\"filename\", $A$1)))","v":"Calc"}]
[null,null,null,null,{"$f":" Time!E$25","v":"Model period ending"},null,null,null,null,{"$f":" Time!J$25","v":"2013-03-31"},{"$f":" Time!K$25","v":"2014-03-31"},{"$f":" Time!L$25","v":"2015-03-31"},{"$f":" Time!M$25","v":"2016-03-31"},{"$f":" Time!N$25","v":"2017-03-31"},{"$f":" Time!O$25","v":"2018-03-31"},{"$f":" Time!P$25","v":"2019-03-31"},{"$f":" Time!Q$25","v":"2020-03-31"},{"$f":" Time!R$25","v":"2021-03-31"},{"$f":" Time!S$25","v":"2022-03-31"},{"$f":" Time!T$25","v":"2023-03-31"},{"$f":" Time!U$25","v":"2024-03-31"}]
[null,null,null,null,{"$f":" Time!E$80","v":"Timeline label"},null,null,null,null,{"$f":" Time!J$80","v":"Pre-Fcst"},{"$f":" Time!K$80","v":"Pre-Fcst"},{"$f":" Time!L$80","v":"Pre-Fcst"},{"$f":" Time!M$80","v":"Pre-Fcst"},{"$f":" Time!N$80","v":"Pre-Fcst"},{"$f":" Time!O$80","v":"Pre-Fcst"},{"$f":" Time!P$80","v":"Pre-Fcst"},{"$f":" Time!Q$80","v":"Pre-Fcst"},{"$f":" Time!R$80","v":"Forecast"},{"$f":" Time!S$80","v":"Forecast"},{"$f":" Time!T$80","v":"Forecast"},{"$f":" Time!U$80","v":"Forecast"}]
[null,null,null,null,{"$f":" Time!E$103","v":"Financial year ending"},null,null,null,null,{"$f":" Time!J$103","v":2013},{"$f":" Time!K$103","v":2014},{"$f":" Time!L$103","v":2015},{"$f":" Time!M$103","v":2016},{"$f":" Time!N$103","v":2017},{"$f":" Time!O$103","v":2018},{"$f":" Time!P$103","v":2019},{"$f":" Time!Q$103","v":2020},{"$f":" Time!R$103","v":2021},{"$f":" Time!S$103","v":2022},{"$f":" Time!T$103","v":2023},{"$f":" Time!U$103","v":2024}]
[null,null,null,null,{"$f":" Time!E$10","v":"Model column counter"},"Constant","Unit","Total",null,{"$f":" Time!J$10","v":1},{"$f":" Time!K$10","v":2},{"$f":" Time!L$10","v":3},{"$f":" Time!M$10","v":4},{"$f":" Time!N$10","v":5},{"$f":" Time!O$10","v":6},{"$f":" Time!P$10","v":7},{"$f":" Time!Q$10","v":8},{"$f":" Time!R$10","v":9},{"$f":" Time!S$10","v":10},{"$f":" Time!T$10","v":11},{"$f":" Time!U$10","v":12}]
[]
["WATER SERVICES"]
[]
[null,"Water RCV closing balance at 31 March 2020"]
[{"$f":" Inputs!A$85","v":"APP8001W"},null,null,null,{"$f":" Inputs!E$85","v":"Wholesale water closing RCV at 31 March 2020 (from PR14 FD)"},{"$f":" Inputs!F$85","v":2417.7536510444002},{"$f":" Inputs!G$85","v":"£m"}]
{"$rows_left_out":464}
{"sheet":"Summary_Output","index":11,"n_rows":105,"n_cols":21,"rows_kept":105,"cut":false,"hidden":false,"merged":[]}
[{"$f":" RIGHT(CELL(\"filename\", $A$1), LEN(CELL(\"filename\", $A$1)) - SEARCH(\"]\", CELL(\"filename\", $A$1)))","v":"Summary_Output"}]
[null,null,null,null,{"$f":" Time!E$25","v":"Model period ending"},null,null,null,null,null,{"$f":" Time!K$25","v":"2014-03-31"},{"$f":" Time!L$25","v":"2015-03-31"},{"$f":" Time!M$25","v":"2016-03-31"},{"$f":" Time!N$25","v":"2017-03-31"},{"$f":" Time!O$25","v":"2018-03-31"},{"$f":" Time!P$25","v":"2019-03-31"},{"$f":" Time!Q$25","v":"2020-03-31"},{"$f":" Time!R$25","v":"2021-03-31"},{"$f":" Time!S$25","v":"2022-03-31"},{"$f":" Time!T$25","v":"2023-03-31"},{"$f":" Time!U$25","v":"2024-03-31"}]
[null,null,null,null,{"$f":" Time!E$80","v":"Timeline label"},null,null,null,null,null,{"$f":" Time!K$80","v":"Pre-Fcst"},{"$f":" Time!L$80","v":"Pre-Fcst"},{"$f":" Time!M$80","v":"Pre-Fcst"},{"$f":" Time!N$80","v":"Pre-Fcst"},{"$f":" Time!O$80","v":"Pre-Fcst"},{"$f":" Time!P$80","v":"Pre-Fcst"},{"$f":" Time!Q$80","v":"Pre-Fcst"},{"$f":" Time!R$80","v":"Forecast"},{"$f":" Time!S$80","v":"Forecast"},{"$f":" Time!T$80","v":"Forecast"},{"$f":" Time!U$80","v":"Forecast"}]
[null,null,null,null,{"$f":" Time!E$103","v":"Financial year ending"},null,null,null,null,null,{"$f":" Time!K$103","v":2014},{"$f":" Time!L$103","v":2015},{"$f":" Time!M$103","v":2016},{"$f":" Time!N$103","v":2017},{"$f":" Time!O$103","v":2018},{"$f":" Time!P$103","v":2019},{"$f":" Time!Q$103","v":2020},{"$f":" Time!R$103","v":2021},{"$f":" Time!S$103","v":2022},{"$f":" Time!T$103","v":2023},{"$f":" Time!U$103","v":2024}]
[null,null,null,null,{"$f":" Time!E$10","v":"Model column counter"},"Constant","Unit",null,null,null,{"$f":" Time!K$10","v":2},{"$f":" Time!L$10","v":3},{"$f":" Time!M$10","v":4},{"$f":" Time!N$10","v":5},{"$f":" Time!O$10","v":6},{"$f":" Time!P$10","v":7},{"$f":" Time!Q$10","v":8},{"$f":" Time!R$10","v":9},{"$f":" Time!S$10","v":10},{"$f":" Time!T$10","v":11},{"$f":" Time!U$10","v":12}]
[]
["WATER SERVICES"]
[]
[null,"Values expressed in 2017-18 FYE CPIH deflated price base for table App8"]
[{"$f":" Calc!A$55","v":"C_APP8002W"},null,null,null,{"$f":" Calc!E$55","v":"Wholesale water closing RCV at 31 March 2020 before midnight adjustments at 2017-18 FYE CPIH deflated price base "},{"$f":" Calc!F$55","v":2798.1414400343024},{"$f":" Calc!G$55","v":"£m"}]
{"$rows_left_out":95}